FailedConsole Output

Skipping 958 KB.. Full Log
soot/toolkits/scalar/AbstractFlowAnalysis.java:64: warning: no @return
  protected abstract A newInitialFlow();
                       ^
/data/jenkins/workspace/soot/soot-master/src/main/java/soot/toolkits/scalar/AbstractFlowAnalysis.java:71: warning: no @return
  protected A entryInitialFlow() {
              ^
/data/jenkins/workspace/soot/soot-master/src/main/java/soot/toolkits/scalar/AbstractFlowAnalysis.java:78: warning: no @return
  protected boolean treatTrapHandlersAsEntries() {
                    ^
/data/jenkins/workspace/soot/soot-master/src/main/java/soot/toolkits/scalar/AbstractFlowAnalysis.java:83: warning: no @return
  protected abstract boolean isForward();
                             ^
/data/jenkins/workspace/soot/soot-master/src/main/java/soot/toolkits/scalar/AbstractFlowAnalysis.java:90: warning: no @param for in1
  protected abstract void merge(A in1, A in2, A out);
                          ^
/data/jenkins/workspace/soot/soot-master/src/main/java/soot/toolkits/scalar/AbstractFlowAnalysis.java:90: warning: no @param for in2
  protected abstract void merge(A in1, A in2, A out);
                          ^
/data/jenkins/workspace/soot/soot-master/src/main/java/soot/toolkits/scalar/AbstractFlowAnalysis.java:90: warning: no @param for out
  protected abstract void merge(A in1, A in2, A out);
                          ^
/data/jenkins/workspace/soot/soot-master/src/main/java/soot/toolkits/scalar/AbstractFlowAnalysis.java:96: warning: no @param for succNode
  protected void merge(N succNode, A in1, A in2, A out) {
                 ^
/data/jenkins/workspace/soot/soot-master/src/main/java/soot/toolkits/scalar/AbstractFlowAnalysis.java:96: warning: no @param for in1
  protected void merge(N succNode, A in1, A in2, A out) {
                 ^
/data/jenkins/workspace/soot/soot-master/src/main/java/soot/toolkits/scalar/AbstractFlowAnalysis.java:96: warning: no @param for in2
  protected void merge(N succNode, A in1, A in2, A out) {
                 ^
/data/jenkins/workspace/soot/soot-master/src/main/java/soot/toolkits/scalar/AbstractFlowAnalysis.java:96: warning: no @param for out
  protected void merge(N succNode, A in1, A in2, A out) {
                 ^
/data/jenkins/workspace/soot/soot-master/src/main/java/soot/toolkits/scalar/AbstractFlowAnalysis.java:101: warning: no @param for source
  protected abstract void copy(A source, A dest);
                          ^
/data/jenkins/workspace/soot/soot-master/src/main/java/soot/toolkits/scalar/AbstractFlowAnalysis.java:101: warning: no @param for dest
  protected abstract void copy(A source, A dest);
                          ^
/data/jenkins/workspace/soot/soot-master/src/main/java/soot/toolkits/scalar/AbstractFlowAnalysis.java:109: warning: no @param for s
  public A getFlowBefore(N s) {
           ^
/data/jenkins/workspace/soot/soot-master/src/main/java/soot/toolkits/scalar/AbstractFlowAnalysis.java:109: warning: no @return
  public A getFlowBefore(N s) {
           ^
/data/jenkins/workspace/soot/soot-master/src/main/java/soot/toolkits/scalar/AbstractFlowAnalysis.java:116: warning: no @param for succNode
  protected void mergeInto(N succNode, A inout, A in) {
                 ^
/data/jenkins/workspace/soot/soot-master/src/main/java/soot/toolkits/scalar/AbstractFlowAnalysis.java:116: warning: no @param for inout
  protected void mergeInto(N succNode, A inout, A in) {
                 ^
/data/jenkins/workspace/soot/soot-master/src/main/java/soot/toolkits/scalar/AbstractFlowAnalysis.java:116: warning: no @param for in
  protected void mergeInto(N succNode, A inout, A in) {
                 ^
/data/jenkins/workspace/soot/soot-master/src/main/java/soot/toolkits/scalar/BoundedFlowSet.java:41: warning: no @param for dest
  public void complement(FlowSet<T> dest);
              ^
/data/jenkins/workspace/soot/soot-master/src/main/java/soot/toolkits/scalar/BoundedFlowSet.java:46: warning: no @return
  public FlowSet<T> topSet();
                    ^
/data/jenkins/workspace/soot/soot-master/src/main/java/soot/toolkits/scalar/FlowSet.java:40: warning: no @return
  public FlowSet<T> clone();
                    ^
/data/jenkins/workspace/soot/soot-master/src/main/java/soot/toolkits/scalar/FlowSet.java:45: warning: no @return
  public FlowSet<T> emptySet();
                    ^
/data/jenkins/workspace/soot/soot-master/src/main/java/soot/toolkits/scalar/FlowSet.java:50: warning: no @param for dest
  public void copy(FlowSet<T> dest);
              ^
/data/jenkins/workspace/soot/soot-master/src/main/java/soot/toolkits/scalar/FlowSet.java:60: warning: no @param for other
  public void union(FlowSet<T> other);
              ^
/data/jenkins/workspace/soot/soot-master/src/main/java/soot/toolkits/scalar/FlowSet.java:66: warning: no @param for other
  public void union(FlowSet<T> other, FlowSet<T> dest);
              ^
/data/jenkins/workspace/soot/soot-master/src/main/java/soot/toolkits/scalar/FlowSet.java:66: warning: no @param for dest
  public void union(FlowSet<T> other, FlowSet<T> dest);
              ^
/data/jenkins/workspace/soot/soot-master/src/main/java/soot/toolkits/scalar/FlowSet.java:71: warning: no @param for other
  public void intersection(FlowSet<T> other);
              ^
/data/jenkins/workspace/soot/soot-master/src/main/java/soot/toolkits/scalar/FlowSet.java:77: warning: no @param for other
  public void intersection(FlowSet<T> other, FlowSet<T> dest);
              ^
/data/jenkins/workspace/soot/soot-master/src/main/java/soot/toolkits/scalar/FlowSet.java:77: warning: no @param for dest
  public void intersection(FlowSet<T> other, FlowSet<T> dest);
              ^
/data/jenkins/workspace/soot/soot-master/src/main/java/soot/toolkits/scalar/FlowSet.java:83: warning: no @param for other
  public void difference(FlowSet<T> other);
              ^
/data/jenkins/workspace/soot/soot-master/src/main/java/soot/toolkits/scalar/FlowSet.java:89: warning: no @param for other
  public void difference(FlowSet<T> other, FlowSet<T> dest);
              ^
/data/jenkins/workspace/soot/soot-master/src/main/java/soot/toolkits/scalar/FlowSet.java:89: warning: no @param for dest
  public void difference(FlowSet<T> other, FlowSet<T> dest);
              ^
/data/jenkins/workspace/soot/soot-master/src/main/java/soot/toolkits/scalar/FlowSet.java:94: warning: no @return
  public boolean isEmpty();
                 ^
/data/jenkins/workspace/soot/soot-master/src/main/java/soot/toolkits/scalar/FlowSet.java:101: warning: no @return
  public int size();
             ^
/data/jenkins/workspace/soot/soot-master/src/main/java/soot/toolkits/scalar/FlowSet.java:106: warning: no @param for obj
  public void add(T obj);
              ^
/data/jenkins/workspace/soot/soot-master/src/main/java/soot/toolkits/scalar/FlowSet.java:111: warning: no @param for obj
  public void add(T obj, FlowSet<T> dest);
              ^
/data/jenkins/workspace/soot/soot-master/src/main/java/soot/toolkits/scalar/FlowSet.java:111: warning: no @param for dest
  public void add(T obj, FlowSet<T> dest);
              ^
/data/jenkins/workspace/soot/soot-master/src/main/java/soot/toolkits/scalar/FlowSet.java:116: warning: no @param for obj
  public void remove(T obj);
              ^
/data/jenkins/workspace/soot/soot-master/src/main/java/soot/toolkits/scalar/FlowSet.java:121: warning: no @param for obj
  public void remove(T obj, FlowSet<T> dest);
              ^
/data/jenkins/workspace/soot/soot-master/src/main/java/soot/toolkits/scalar/FlowSet.java:121: warning: no @param for dest
  public void remove(T obj, FlowSet<T> dest);
              ^
/data/jenkins/workspace/soot/soot-master/src/main/java/soot/toolkits/scalar/FlowSet.java:126: warning: no @param for obj
  public boolean contains(T obj);
                 ^
/data/jenkins/workspace/soot/soot-master/src/main/java/soot/toolkits/scalar/FlowSet.java:126: warning: no @return
  public boolean contains(T obj);
                 ^
/data/jenkins/workspace/soot/soot-master/src/main/java/soot/toolkits/scalar/FlowSet.java:131: warning: no @param for other
  public boolean isSubSet(FlowSet<T> other);
                 ^
/data/jenkins/workspace/soot/soot-master/src/main/java/soot/toolkits/scalar/FlowSet.java:131: warning: no @return
  public boolean isSubSet(FlowSet<T> other);
                 ^
/data/jenkins/workspace/soot/soot-master/src/main/java/soot/toolkits/scalar/FlowSet.java:142: warning: no @return
  public List<T> toList();
                 ^
/data/jenkins/workspace/soot/soot-master/src/main/java/soot/toolkits/scalar/AbstractFlowAnalysis.java:53: warning: no @param for graph
  public AbstractFlowAnalysis(DirectedGraph<N> graph) {
         ^
/data/jenkins/workspace/soot/soot-master/src/main/java/soot/toolkits/scalar/BackwardFlowAnalysis.java:34: warning: no @param for graph
  public BackwardFlowAnalysis(DirectedGraph<N> graph) {
         ^
/data/jenkins/workspace/soot/soot-master/src/main/java/soot/toolkits/scalar/BinaryIdentitySet.java:26: error: reference not found
 * An optimized kind of {@link IdentityHashSet} that only holds two objects. (Allows for faster comparison.)
                               ^
/data/jenkins/workspace/soot/soot-master/src/main/java/soot/toolkits/scalar/BoundedFlowSet.java:29: error: unexpected content
 * @see: FlowUniverse
   ^
/data/jenkins/workspace/soot/soot-master/src/main/java/soot/toolkits/scalar/BranchedFlowAnalysis.java:55: warning: no @param for in
  protected abstract void flowThrough(A in, Unit s, List<A> fallOut, List<A> branchOuts);
                          ^
/data/jenkins/workspace/soot/soot-master/src/main/java/soot/toolkits/scalar/BranchedFlowAnalysis.java:55: warning: no @param for s
  protected abstract void flowThrough(A in, Unit s, List<A> fallOut, List<A> branchOuts);
                          ^
/data/jenkins/workspace/soot/soot-master/src/main/java/soot/toolkits/scalar/BranchedFlowAnalysis.java:55: warning: no @param for fallOut
  protected abstract void flowThrough(A in, Unit s, List<A> fallOut, List<A> branchOuts);
                          ^
/data/jenkins/workspace/soot/soot-master/src/main/java/soot/toolkits/scalar/BranchedFlowAnalysis.java:55: warning: no @param for branchOuts
  protected abstract void flowThrough(A in, Unit s, List<A> fallOut, List<A> branchOuts);
                          ^
/data/jenkins/workspace/soot/soot-master/src/main/java/soot/toolkits/scalar/ConstantInitializerToTagTransformer.java:84: error: unknown tag: clinit
   * Transforms the given class, i.e. scans for a <clinit> method and generates new constant value tags for all constant
                                                  ^
/data/jenkins/workspace/soot/soot-master/src/main/java/soot/toolkits/scalar/ConstantInitializerToTagTransformer.java:90: error: unknown tag: clinit
   *          True if the assignments inside the <clinit> method shall be removed, otherwise false
                                                 ^
/data/jenkins/workspace/soot/soot-master/src/main/java/soot/toolkits/scalar/ConstantInitializerToTagTransformer.java:62: error: unknown tag: clinit
 * This is the reverse operation of the {@link ConstantValueToInitializerTransformer}. We scan for <clinit> methods that
                                                                                                   ^
/data/jenkins/workspace/soot/soot-master/src/main/java/soot/toolkits/scalar/ConstantInitializerToTagTransformer.java:64: error: unknown tag: clinit
 * assignment in the <clinit> method is removed. If <clinit> runs empty, it is deleted as well.
                     ^
/data/jenkins/workspace/soot/soot-master/src/main/java/soot/toolkits/scalar/ConstantInitializerToTagTransformer.java:64: error: unknown tag: clinit
 * assignment in the <clinit> method is removed. If <clinit> runs empty, it is deleted as well.
                                                    ^
/data/jenkins/workspace/soot/soot-master/src/main/java/soot/toolkits/scalar/FastColorer.java:54: warning: no @param for unitBody
  public static void unsplitAssignColorsToLocals(Body unitBody, Map<Local, Object> localToGroup,
                     ^
/data/jenkins/workspace/soot/soot-master/src/main/java/soot/toolkits/scalar/FastColorer.java:54: warning: no @param for localToGroup
  public static void unsplitAssignColorsToLocals(Body unitBody, Map<Local, Object> localToGroup,
                     ^
/data/jenkins/workspace/soot/soot-master/src/main/java/soot/toolkits/scalar/FastColorer.java:54: warning: no @param for localToColor
  public static void unsplitAssignColorsToLocals(Body unitBody, Map<Local, Object> localToGroup,
                     ^
/data/jenkins/workspace/soot/soot-master/src/main/java/soot/toolkits/scalar/FastColorer.java:54: warning: no @param for groupToColorCount
  public static void unsplitAssignColorsToLocals(Body unitBody, Map<Local, Object> localToGroup,
                     ^
/data/jenkins/workspace/soot/soot-master/src/main/java/soot/toolkits/scalar/FastColorer.java:168: warning: no @param for unitBody
  public static void assignColorsToLocals(Body unitBody, Map<Local, Object> localToGroup, Map<Local, Integer> localToColor,
                     ^
/data/jenkins/workspace/soot/soot-master/src/main/java/soot/toolkits/scalar/FastColorer.java:168: warning: no @param for localToGroup
  public static void assignColorsToLocals(Body unitBody, Map<Local, Object> localToGroup, Map<Local, Integer> localToColor,
                     ^
/data/jenkins/workspace/soot/soot-master/src/main/java/soot/toolkits/scalar/FastColorer.java:168: warning: no @param for localToColor
  public static void assignColorsToLocals(Body unitBody, Map<Local, Object> localToGroup, Map<Local, Integer> localToColor,
                     ^
/data/jenkins/workspace/soot/soot-master/src/main/java/soot/toolkits/scalar/FastColorer.java:168: warning: no @param for groupToColorCount
  public static void assignColorsToLocals(Body unitBody, Map<Local, Object> localToGroup, Map<Local, Integer> localToColor,
                     ^
/data/jenkins/workspace/soot/soot-master/src/main/java/soot/toolkits/scalar/FlowAnalysis.java:410: warning: no @param for graph
  public FlowAnalysis(DirectedGraph<N> graph) {
         ^
/data/jenkins/workspace/soot/soot-master/src/main/java/soot/toolkits/scalar/FlowSet.java:34: error: unexpected content
 * @see: FlowUniverse
   ^
/data/jenkins/workspace/soot/soot-master/src/main/java/soot/toolkits/scalar/ForwardFlowAnalysis.java:35: warning: no @param for graph
  public ForwardFlowAnalysis(DirectedGraph<N> graph) {
         ^
/data/jenkins/workspace/soot/soot-master/src/main/java/soot/toolkits/scalar/ForwardFlowAnalysisExtended.java:78: warning: no @return
  protected abstract A newInitialFlow();
                       ^
/data/jenkins/workspace/soot/soot-master/src/main/java/soot/toolkits/scalar/ForwardFlowAnalysisExtended.java:83: warning: no @return
  protected abstract A entryInitialFlow();
                       ^
/data/jenkins/workspace/soot/soot-master/src/main/java/soot/toolkits/scalar/ForwardFlowAnalysisExtended.java:86: warning: no @param for source
  protected abstract void copy(A source, A dest);
                          ^
/data/jenkins/workspace/soot/soot-master/src/main/java/soot/toolkits/scalar/ForwardFlowAnalysisExtended.java:86: warning: no @param for dest
  protected abstract void copy(A source, A dest);
                          ^
/data/jenkins/workspace/soot/soot-master/src/main/java/soot/toolkits/scalar/ForwardFlowAnalysisExtended.java:93: warning: no @param for in1
  protected abstract void merge(A in1, A in2, A out);
                          ^
/data/jenkins/workspace/soot/soot-master/src/main/java/soot/toolkits/scalar/ForwardFlowAnalysisExtended.java:93: warning: no @param for in2
  protected abstract void merge(A in1, A in2, A out);
                          ^
/data/jenkins/workspace/soot/soot-master/src/main/java/soot/toolkits/scalar/ForwardFlowAnalysisExtended.java:93: warning: no @param for out
  protected abstract void merge(A in1, A in2, A out);
                          ^
/data/jenkins/workspace/soot/soot-master/src/main/java/soot/toolkits/scalar/ForwardFlowAnalysisExtended.java:99: warning: no @param for succNode
  protected void merge(N succNode, A in1, A in2, A out) {
                 ^
/data/jenkins/workspace/soot/soot-master/src/main/java/soot/toolkits/scalar/ForwardFlowAnalysisExtended.java:99: warning: no @param for in1
  protected void merge(N succNode, A in1, A in2, A out) {
                 ^
/data/jenkins/workspace/soot/soot-master/src/main/java/soot/toolkits/scalar/ForwardFlowAnalysisExtended.java:99: warning: no @param for in2
  protected void merge(N succNode, A in1, A in2, A out) {
                 ^
/data/jenkins/workspace/soot/soot-master/src/main/java/soot/toolkits/scalar/ForwardFlowAnalysisExtended.java:99: warning: no @param for out
  protected void merge(N succNode, A in1, A in2, A out) {
                 ^
/data/jenkins/workspace/soot/soot-master/src/main/java/soot/toolkits/scalar/ForwardFlowAnalysisExtended.java:106: warning: no @param for succNode
  protected void mergeInto(N succNode, A inout, A in) {
                 ^
/data/jenkins/workspace/soot/soot-master/src/main/java/soot/toolkits/scalar/ForwardFlowAnalysisExtended.java:106: warning: no @param for inout
  protected void mergeInto(N succNode, A inout, A in) {
                 ^
/data/jenkins/workspace/soot/soot-master/src/main/java/soot/toolkits/scalar/ForwardFlowAnalysisExtended.java:106: warning: no @param for in
  protected void mergeInto(N succNode, A inout, A in) {
                 ^
/data/jenkins/workspace/soot/soot-master/src/main/java/soot/toolkits/scalar/ForwardFlowAnalysisExtended.java:220: warning: no @param for s
  public A getFlowBefore(N s) {
           ^
/data/jenkins/workspace/soot/soot-master/src/main/java/soot/toolkits/scalar/ForwardFlowAnalysisExtended.java:220: warning: no @return
  public A getFlowBefore(N s) {
           ^
/data/jenkins/workspace/soot/soot-master/src/main/java/soot/toolkits/scalar/ForwardFlowAnalysisExtended.java:60: warning: no @param for graph
  public ForwardFlowAnalysisExtended(DirectedGraph<N> graph) {
         ^
/data/jenkins/workspace/soot/soot-master/src/main/java/soot/toolkits/scalar/GuaranteedDefs.java:74: warning: no @param for s
  public List getGuaranteedDefs(Unit s) {
              ^
/data/jenkins/workspace/soot/soot-master/src/main/java/soot/toolkits/scalar/GuaranteedDefs.java:74: warning: no @return
  public List getGuaranteedDefs(Unit s) {
              ^
/data/jenkins/workspace/soot/soot-master/src/main/java/soot/toolkits/scalar/LocalDefs.java:47: warning: no description for @param
     * @param body
       ^
/data/jenkins/workspace/soot/soot-master/src/main/java/soot/toolkits/scalar/LocalDefs.java:60: error: @param name not found
     * @param expectUndefinedUses
              ^
/data/jenkins/workspace/soot/soot-master/src/main/java/soot/toolkits/scalar/LocalPacker.java:53: error: malformed HTML
 * for(int i; i < k; i++); for(int j; j < k; j++);
                ^
/data/jenkins/workspace/soot/soot-master/src/main/java/soot/toolkits/scalar/LocalPacker.java:53: error: malformed HTML
 * for(int i; i < k; i++); for(int j; j < k; j++);
                                        ^
/data/jenkins/workspace/soot/soot-master/src/main/java/soot/toolkits/scalar/LocalPacker.java:55: error: malformed HTML
 * would be transformed into: for(int i; i < k; i++); for(int i; i < k; i++);
                                           ^
/data/jenkins/workspace/soot/soot-master/src/main/java/soot/toolkits/scalar/LocalPacker.java:55: error: malformed HTML
 * would be transformed into: for(int i; i < k; i++); for(int i; i < k; i++);
                                                                   ^
/data/jenkins/workspace/soot/soot-master/src/main/java/soot/toolkits/scalar/LocalSplitter.java:57: error: malformed HTML
 * for(int i; i < k; i++); for(int i; i < k; i++);
                ^
/data/jenkins/workspace/soot/soot-master/src/main/java/soot/toolkits/scalar/LocalSplitter.java:57: error: malformed HTML
 * for(int i; i < k; i++); for(int i; i < k; i++);
                                        ^
/data/jenkins/workspace/soot/soot-master/src/main/java/soot/toolkits/scalar/LocalSplitter.java:59: error: malformed HTML
 * would be transformed into: for(int i; i < k; i++); for(int j; j < k; j++);
                                           ^
/data/jenkins/workspace/soot/soot-master/src/main/java/soot/toolkits/scalar/LocalSplitter.java:59: error: malformed HTML
 * would be transformed into: for(int i; i < k; i++); for(int j; j < k; j++);
                                                                   ^
/data/jenkins/workspace/soot/soot-master/src/main/java/soot/toolkits/scalar/SmartLocalDefs.java:53: error: no tag name after @
 * should use {@see SimpleLocalDefs}.
              ^
/data/jenkins/workspace/soot/soot-master/src/main/java/soot/toolkits/scalar/SmartLocalDefs.java:55: error: no tag name after @
 * Be warned: This implementation requires a lot of memory and CPU time, normally {@see SimpleLocalDefs} is much faster.
                                                                                  ^
/data/jenkins/workspace/soot/soot-master/src/main/java/soot/toolkits/scalar/UnitValueBoxPair.java:38: error: @param name not found
   * @param local
            ^
/data/jenkins/workspace/soot/soot-master/src/main/java/soot/toolkits/exceptions/ThrowableSet.java:204: error: unexpected text
   * @throws {@link
     ^
/data/jenkins/workspace/soot/soot-master/src/main/java/soot/toolkits/exceptions/ThrowableSet.java:860: error: text not allowed in <ul> element
   * @return An abbreviated representation of the contents of this set.
             ^
/data/jenkins/workspace/soot/soot-master/src/main/java/soot/toolkits/exceptions/ThrowableSet.java:848: error: element not closed: ul
   * <ul>
     ^
/data/jenkins/workspace/soot/soot-master/src/main/java/soot/toolkits/exceptions/ThrowableSet.java:72: error: unexpected end tag: </p>
 * </p>
   ^
/data/jenkins/workspace/soot/soot-master/src/main/java/soot/toolkits/exceptions/TrapTightener.java:154: error: malformed HTML
   * @return <tt>true</tt> if <tt>u</tt> might throw an exception caught by <tt>t</tt>, according to <tt>g</tt.
                                                                                                          ^
/data/jenkins/workspace/soot/soot-master/src/main/java/soot/toolkits/exceptions/TrapTightener.java:154: error: element not closed: tt
   * @return <tt>true</tt> if <tt>u</tt> might throw an exception caught by <tt>t</tt>, according to <tt>g</tt.
                                                                                                     ^
/data/jenkins/workspace/soot/soot-master/src/main/java/soot/toolkits/graph/ArrayRefBlockGraph.java:78: error: unexpected text
   * This implementation chooses as block leaders all the <tt>Unit</tt>s that {@link BlockGraph.computerLeaders()}, and adds:
                                                                              ^
/data/jenkins/workspace/soot/soot-master/src/main/java/soot/toolkits/graph/ArrayRefBlockGraph.java:82: error: unexpected text
   * <li>All <tt>Unit</tt>s which contain an array reference, as defined by {@link Stmt.containsArrayRef()} and
                                                                            ^
/data/jenkins/workspace/soot/soot-master/src/main/java/soot/toolkits/graph/ArrayRefBlockGraph.java:83: error: unexpected text
   * {@link Inst.containsArrayRef()}.
     ^
/data/jenkins/workspace/soot/soot-master/src/main/java/soot/toolkits/graph/ArrayRefBlockGraph.java:86: error: unexpected text
   * {@link Trap.getLastUnit()}.</li>
     ^
/data/jenkins/workspace/soot/soot-master/src/main/java/soot/toolkits/graph/ArrayRefBlockGraph.java:89: error: unexpected end tag: </p>
   * </p>
     ^
/data/jenkins/workspace/soot/soot-master/src/main/java/soot/toolkits/graph/BlockGraph.java:102: error: unexpected end tag: </p>
   * </p>
     ^
/data/jenkins/workspace/soot/soot-master/src/main/java/soot/toolkits/graph/ArrayRefBlockGraph.java:51: error: @param name not found
   * @param the
            ^
/data/jenkins/workspace/soot/soot-master/src/main/java/soot/toolkits/graph/BlockGraph.java:50: error: reference not found
 * <code>BlockGraph</code>'s definition of {@link computeLeaders()}.
                                                  ^
/data/jenkins/workspace/soot/soot-master/src/main/java/soot/toolkits/graph/ClassicCompleteUnitGraph.java:62: error: end tag missing: </tt>
 * parameters passed to the <tt>ExceptionalUnitGraph<tt> constructor.
                                                    ^
/data/jenkins/workspace/soot/soot-master/src/main/java/soot/toolkits/graph/ClassicCompleteUnitGraph.java:62: error: end tag missing: </tt>
 * parameters passed to the <tt>ExceptionalUnitGraph<tt> constructor.
                            ^
/data/jenkins/workspace/soot/soot-master/src/main/java/soot/toolkits/graph/ClassicCompleteUnitGraph.java:69: error: unexpected end tag: </p>
 * </p>
   ^
/data/jenkins/workspace/soot/soot-master/src/main/java/soot/toolkits/graph/ClassicCompleteUnitGraph.java:75: error: @param name not found
   * @param the
            ^
/data/jenkins/workspace/soot/soot-master/src/main/java/soot/toolkits/graph/ExceptionalBlockGraph.java:106: error: identifier expected
   * @param {@inheritDoc}
     ^
/data/jenkins/workspace/soot/soot-master/src/main/java/soot/toolkits/graph/CompleteBlockGraph.java:32: error: reference not found
 * <code>CompleteBlockGraph</code> assumes that every {@link Unit} covered by a {@link Trap} has the potential to throw an
                                                             ^
/data/jenkins/workspace/soot/soot-master/src/main/java/soot/toolkits/graph/CompleteBlockGraph.java:33: error: reference not found
 * exception caught by the {@link Trap}. This generally has the effect of separating every covered {@link Unit} into a
                                                                                                          ^
/data/jenkins/workspace/soot/soot-master/src/main/java/soot/toolkits/graph/ExceptionalUnitGraph.java:268: error: malformed HTML
   *         <code>Unit</code>'s exceptions escape the method, it will be mapped to <code>null</code, rather than to a
                                                                                              ^
/data/jenkins/workspace/soot/soot-master/src/main/java/soot/toolkits/graph/ExceptionalUnitGraph.java:268: error: end tag missing: </code>
   *         <code>Unit</code>'s exceptions escape the method, it will be mapped to <code>null</code, rather than to a
                                                                                    ^
/data/jenkins/workspace/soot/soot-master/src/main/java/soot/toolkits/graph/ExceptionalUnitGraph.java:611: error: end tag missing: </code>
   * and to document the conditions under which <code>ExceptionalUnitGraph considers a node to be a head or
                                                ^
/data/jenkins/workspace/soot/soot-master/src/main/java/soot/toolkits/graph/CompleteUnitGraph.java:56: error: unexpected end tag: </p>
 * </p>
   ^
/data/jenkins/workspace/soot/soot-master/src/main/java/soot/toolkits/graph/CytronDominanceFrontier.java:103: error: malformed HTML
   *      DF(X) < - null
                ^
/data/jenkins/workspace/soot/soot-master/src/main/java/soot/toolkits/graph/CytronDominanceFrontier.java:105: error: malformed HTML
   *        if (idom(Y)!=X) then DF(X) <- DF(X) U Y
                                       ^
/data/jenkins/workspace/soot/soot-master/src/main/java/soot/toolkits/graph/CytronDominanceFrontier.java:109: error: malformed HTML
   *              if (idom(Y)!=X) then DF(X) <- DF(X) U Y
                                             ^
/data/jenkins/workspace/soot/soot-master/src/main/java/soot/toolkits/graph/ExceptionalGraph.java:77: error: ')' missing in reference
     * node that includes {@link trap().getBeginUnit()}).
                          ^
/data/jenkins/workspace/soot/soot-master/src/main/java/soot/toolkits/graph/PseudoTopologicalOrderer.java:166: error: unterminated signature
   * @deprecated use {@link #newList(DirectedGraph, boolean))} instead
                     ^
/data/jenkins/workspace/soot/soot-master/src/main/java/soot/toolkits/graph/PseudoTopologicalOrderer.java:176: error: @param name not found
   * @param isReverse
            ^
/data/jenkins/workspace/soot/soot-master/src/main/java/soot/toolkits/graph/PseudoTopologicalOrderer.java:178: error: unterminated signature
   * @deprecated use {@link #newList(DirectedGraph, boolean))} instead
                     ^
/data/jenkins/workspace/soot/soot-master/src/main/java/soot/toolkits/graph/PseudoTopologicalOrderer.java:189: error: unterminated signature
   * @deprecated use {@link #newList(DirectedGraph, boolean))} instead
                     ^
/data/jenkins/workspace/soot/soot-master/src/main/java/soot/toolkits/graph/SlowPseudoTopologicalOrderer.java:307: error: unterminated signature
   * @deprecated use {@link #newList(DirectedGraph, boolean))} instead
                     ^
/data/jenkins/workspace/soot/soot-master/src/main/java/soot/toolkits/graph/SlowPseudoTopologicalOrderer.java:317: error: @param name not found
   * @param isReverse
            ^
/data/jenkins/workspace/soot/soot-master/src/main/java/soot/toolkits/graph/SlowPseudoTopologicalOrderer.java:319: error: unterminated signature
   * @deprecated use {@link #newList(DirectedGraph, boolean))} instead
                     ^
/data/jenkins/workspace/soot/soot-master/src/main/java/soot/toolkits/graph/SlowPseudoTopologicalOrderer.java:330: error: unterminated signature
   * @deprecated use {@link #newList(DirectedGraph, boolean))} instead
                     ^
/data/jenkins/workspace/soot/soot-master/src/main/java/soot/toolkits/graph/SlowPseudoTopologicalOrderer.java:39: error: unexpected content
 * @see: PseudoTopologicalOrderer
   ^
/data/jenkins/workspace/soot/soot-master/src/main/java/soot/toolkits/graph/TrapUnitGraph.java:66: error: @param name not found
   * @param the
            ^
/data/jenkins/workspace/soot/soot-master/src/main/java/soot/toolkits/graph/ZonedBlockGraph.java:80: error: unexpected text
   * This implementation chooses as block leaders all the <tt>Unit</tt>s that {@link BlockGraph.computerLeaders()}, and adds:
                                                                              ^
/data/jenkins/workspace/soot/soot-master/src/main/java/soot/toolkits/graph/ZonedBlockGraph.java:85: error: unexpected text
   * {@link Trap.getBeginUnit()}.</li>
     ^
/data/jenkins/workspace/soot/soot-master/src/main/java/soot/toolkits/graph/ZonedBlockGraph.java:88: error: unexpected text
   * {@link Trap.getEndUnit()}.</li>
     ^
/data/jenkins/workspace/soot/soot-master/src/main/java/soot/toolkits/graph/ZonedBlockGraph.java:91: error: unexpected end tag: </p>
   * </p>
     ^
/data/jenkins/workspace/soot/soot-master/src/main/java/soot/toolkits/graph/ZonedBlockGraph.java:35: error: malformed HTML
 * handler will start a new Block, and any <ttUnit</tt> which is the last <tt>Unit</tt> to be covered a some exception
                                           ^
/data/jenkins/workspace/soot/soot-master/src/main/java/soot/toolkits/graph/ZonedBlockGraph.java:35: error: unexpected end tag: </tt>
 * handler will start a new Block, and any <ttUnit</tt> which is the last <tt>Unit</tt> to be covered a some exception
                                                  ^
/data/jenkins/workspace/soot/soot-master/src/main/java/soot/toolkits/graph/pdg/HashMutablePDG.java:617: error: @param name not found
   * @param The
            ^
/data/jenkins/workspace/soot/soot-master/src/main/java/soot/toolkits/graph/pdg/PDGRegion.java:256: error: @param name not found
   * @param a
            ^
/data/jenkins/workspace/soot/soot-master/src/main/java/soot/Unit.java:85: error: reference not found
   * @see soot.shimple.Shimple#redirectToPreds(Chain, Unit)
          ^
/data/jenkins/workspace/soot/soot-master/src/main/java/soot/AbstractASMBackend.java:502: error: @param name not found
   * @param fv
            ^
/data/jenkins/workspace/soot/soot-master/src/main/java/soot/AbstractASMBackend.java:504: error: @param name not found
   * @param f
            ^
/data/jenkins/workspace/soot/soot-master/src/main/java/soot/PolymorphicMethodRef.java:50: error: no tag name after @
   * {@see http://docs.oracle.com/javase/specs/jls/se11/html/jls-15.html#jls-15.12.4.4}
     ^
/data/jenkins/workspace/soot/soot-master/src/main/java/soot/PolymorphicMethodRef.java:32: error: reference not found
 * {@link java.lang.invoke.VarHandle}. As described in
          ^
/data/jenkins/workspace/soot/soot-master/src/main/java/soot/Scene.java:1151: error: bad HTML entity
   * Returns a chain of the application classes in this scene. These classes are the ones which can be freely analysed &
                                                                                                                       ^
/data/jenkins/workspace/soot/soot-master/src/main/java/soot/SootMethod.java:570: error: unknown tag: clinit
   * @return yes, if this function is a constructor. Please not that <clinit> methods are not treated as constructors in this
                                                                     ^
/data/jenkins/workspace/soot/soot-master/src/main/java/soot/SourceLocator.java:555: error: ')' missing in reference
   * If {@link Options#v()#output_jar()} is set, returns the name of the jar file to which the output will be written. The
        ^
/data/jenkins/workspace/soot/soot-master/src/main/java/soot/UnitPatchingChain.java:36: error: unknown tag: X
 * PatchingChain<X extends Unit> is not allowed to contain such new statements, since they are not a subclass of X.
                ^
/data/jenkins/workspace/soot/soot-master/src/main/java/soot/asm/AsmClassSource.java:49: error: @param name not found
   * @param data
            ^
/data/jenkins/workspace/soot/soot-master/src/main/java/soot/jimple/Jimple.java:114: error: bad use of '>'
 * Immediate -> Local | Constant <br>
              ^
/data/jenkins/workspace/soot/soot-master/src/main/java/soot/jimple/Jimple.java:115: error: bad use of '>'
 * RValue -> Local | Constant | ConcreteRef | Expr<br>
           ^
/data/jenkins/workspace/soot/soot-master/src/main/java/soot/jimple/Jimple.java:116: error: bad use of '>'
 * Variable -> Local | ArrayRef | InstanceFieldRef | StaticFieldRef <br>
             ^
/data/jenkins/workspace/soot/soot-master/src/main/java/soot/jimple/JimpleBody.java:126: error: bad HTML entity
  /** Inserts usual statements for handling this & parameters into body. */
                                                 ^
/data/jenkins/workspace/soot/soot-master/src/main/java/soot/jimple/JimpleBody.java:132: error: bad HTML entity
   * Inserts usual statements for handling this & parameters into body.
                                                ^
/data/jenkins/workspace/soot/soot-master/src/main/java/soot/jimple/toolkits/invoke/SynchronizerManager.java:78: error: malformed HTML
          $r3 = <quack: java.lang.Class class$quack>;
                ^
/data/jenkins/workspace/soot/soot-master/src/main/java/soot/jimple/toolkits/invoke/SynchronizerManager.java:78: error: bad use of '>'
          $r3 = <quack: java.lang.Class class$quack>;
                                                   ^
/data/jenkins/workspace/soot/soot-master/src/main/java/soot/jimple/toolkits/invoke/SynchronizerManager.java:81: error: malformed HTML
          $r3 = .staticinvoke <quack: java.lang.Class class$(java.lang.String)>("quack");
                              ^
/data/jenkins/workspace/soot/soot-master/src/main/java/soot/jimple/toolkits/invoke/SynchronizerManager.java:81: error: bad use of '>'
          $r3 = .staticinvoke <quack: java.lang.Class class$(java.lang.String)>("quack");
                                                                              ^
/data/jenkins/workspace/soot/soot-master/src/main/java/soot/jimple/toolkits/invoke/SynchronizerManager.java:82: error: malformed HTML
          <quack: java.lang.Class class$quack> = $r3;
          ^
/data/jenkins/workspace/soot/soot-master/src/main/java/soot/jimple/toolkits/invoke/SynchronizerManager.java:82: error: bad use of '>'
          <quack: java.lang.Class class$quack> = $r3;
                                             ^
/data/jenkins/workspace/soot/soot-master/src/main/java/soot/jimple/toolkits/invoke/SynchronizerManager.java:242: error: malformed HTML
               $r2 = .staticinvoke <java.lang.Class: java.lang.Class forName(java.lang.String)>(r0);
                                   ^
/data/jenkins/workspace/soot/soot-master/src/main/java/soot/jimple/toolkits/invoke/SynchronizerManager.java:242: error: bad use of '>'
               $r2 = .staticinvoke <java.lang.Class: java.lang.Class forName(java.lang.String)>(r0);
                                                                                              ^
/data/jenkins/workspace/soot/soot-master/src/main/java/soot/jimple/toolkits/invoke/SynchronizerManager.java:249: error: malformed HTML
               $r5 = .virtualinvoke r1.<java.lang.Throwable: java.lang.String getMessage()>();
                                       ^
/data/jenkins/workspace/soot/soot-master/src/main/java/soot/jimple/toolkits/invoke/SynchronizerManager.java:249: error: bad use of '>'
               $r5 = .virtualinvoke r1.<java.lang.Throwable: java.lang.String getMessage()>();
                                                                                          ^
/data/jenkins/workspace/soot/soot-master/src/main/java/soot/jimple/toolkits/invoke/SynchronizerManager.java:250: error: malformed HTML
               .specialinvoke $r4.<java.lang.NoClassDefFoundError: .void <init>(java.lang.String)>($r5);
                                  ^
/data/jenkins/workspace/soot/soot-master/src/main/java/soot/jimple/toolkits/invoke/SynchronizerManager.java:250: error: unknown tag: init
               .specialinvoke $r4.<java.lang.NoClassDefFoundError: .void <init>(java.lang.String)>($r5);
                                                                         ^
/data/jenkins/workspace/soot/soot-master/src/main/java/soot/jimple/toolkits/invoke/SynchronizerManager.java:250: error: bad use of '>'
               .specialinvoke $r4.<java.lang.NoClassDefFoundError: .void <init>(java.lang.String)>($r5);
                                                                                                 ^
/data/jenkins/workspace/soot/soot-master/src/main/java/soot/jimple/toolkits/invoke/ThrowManager.java:57: error: unknown tag: init
   * r928 = new java.lang.NullPointerException; specialinvoke r928."<init>"(); throw r928;
                                                                    ^
/data/jenkins/workspace/soot/soot-master/src/main/java/soot/jimple/toolkits/pointer/StrongLocalMustAliasAnalysis.java:40: error: reference not found
 * is redefined in a loop, the must-alias information is invalidated and set to {@link LocalMustAliasAnalysis#UNKNOWN}. E.g.
                                                                                       ^
/data/jenkins/workspace/soot/soot-master/src/main/java/soot/jimple/toolkits/pointer/nativemethods/JavaLangReflectArrayNative.java:81: error: unknown tag: param0
   * @param0[] = @param1
     ^

Command line was: /data/jenkins/tools/hudson.model.JDK/Oracle_JDK_8/jre/../bin/javadoc @options @packages

Refer to the generated Javadoc files in '/data/jenkins/workspace/soot/soot-master/target/apidocs' dir.

org.apache.maven.reporting.MavenReportException: 
Exit code: 1 - /data/jenkins/workspace/soot/soot-master/src/main/java/soot/BodyTransformer.java:46: warning: no @param for options
  public final void transform(Body b, String phaseName, Map<String, String> options) {
                    ^
/data/jenkins/workspace/soot/soot-master/src/main/java/soot/toolkits/graph/UnitGraph.java:196: warning: no @return
  protected Map<Unit, List<Unit>> combineMapValues(Map<Unit, List<Unit>> mapA, Map<Unit, List<Unit>> mapB) {
                                  ^
/data/jenkins/workspace/soot/soot-master/src/main/java/soot/toolkits/graph/DirectedGraph.java:38: warning: no @return
  public List<N> getHeads();
                 ^
/data/jenkins/workspace/soot/soot-master/src/main/java/soot/toolkits/graph/DirectedGraph.java:41: warning: no @return
  public List<N> getTails();
                 ^
/data/jenkins/workspace/soot/soot-master/src/main/java/soot/toolkits/graph/DirectedGraph.java:46: warning: no @param for s
  public List<N> getPredsOf(N s);
                 ^
/data/jenkins/workspace/soot/soot-master/src/main/java/soot/toolkits/graph/DirectedGraph.java:46: warning: no @return
  public List<N> getPredsOf(N s);
                 ^
/data/jenkins/workspace/soot/soot-master/src/main/java/soot/toolkits/graph/DirectedGraph.java:51: warning: no @param for s
  public List<N> getSuccsOf(N s);
                 ^
/data/jenkins/workspace/soot/soot-master/src/main/java/soot/toolkits/graph/DirectedGraph.java:51: warning: no @return
  public List<N> getSuccsOf(N s);
                 ^
/data/jenkins/workspace/soot/soot-master/src/main/java/soot/toolkits/graph/DirectedGraph.java:56: warning: no @return
  public int size();
             ^
/data/jenkins/workspace/soot/soot-master/src/main/java/soot/jbco/util/SimpleExceptionalGraph.java:43: warning: no description for @param
   * @param body
     ^
/data/jenkins/workspace/soot/soot-master/src/main/java/soot/SceneTransformer.java:31: warning: no @param for phaseName
  public final void transform(String phaseName, Map<String, String> options) {
                    ^
/data/jenkins/workspace/soot/soot-master/src/main/java/soot/SceneTransformer.java:31: warning: no @param for options
  public final void transform(String phaseName, Map<String, String> options) {
                    ^
/data/jenkins/workspace/soot/soot-master/src/main/java/soot/SceneTransformer.java:50: warning: no @param for phaseName
  protected abstract void internalTransform(String phaseName, Map<String, String> options);
                          ^
/data/jenkins/workspace/soot/soot-master/src/main/java/soot/SceneTransformer.java:50: warning: no @param for options
  protected abstract void internalTransform(String phaseName, Map<String, String> options);
                          ^
/data/jenkins/workspace/soot/soot-master/src/main/java/soot/jbco/jimpleTransformations/ClassRenamer.java:192: warning: no @return
  public Map<String, String> getClassNameMapping(BiPredicate<String, String> predicate) {
                             ^
/data/jenkins/workspace/soot/soot-master/src/main/java/soot/jbco/jimpleTransformations/MethodRenamer.java:89: error: unknown tag: similar
 * classes that do not have methods with <similar>similar</similar> to searching signature, are removed. The left items that
                                         ^
/data/jenkins/workspace/soot/soot-master/src/main/java/soot/jbco/jimpleTransformations/MethodRenamer.java:89: error: unknown tag: similar
 * classes that do not have methods with <similar>similar</similar> to searching signature, are removed. The left items that
                                                         ^
/data/jenkins/workspace/soot/soot-master/src/main/java/soot/toolkits/scalar/FlowAnalysis.java:436: warning: no @param for s
  public A getFlowAfter(N s) {
           ^
/data/jenkins/workspace/soot/soot-master/src/main/java/soot/toolkits/scalar/FlowAnalysis.java:436: warning: no @return
  public A getFlowAfter(N s) {
           ^
/data/jenkins/workspace/soot/soot-master/src/main/java/soot/toolkits/scalar/FlowAnalysis.java:505: warning: no description for @param
   * @param from
     ^
/data/jenkins/workspace/soot/soot-master/src/main/java/soot/toolkits/scalar/FlowAnalysis.java:506: warning: no description for @param
   * @param mergeNode
     ^
/data/jenkins/workspace/soot/soot-master/src/main/java/soot/toolkits/scalar/AbstractFlowAnalysis.java:64: warning: no @return
  protected abstract A newInitialFlow();
                       ^
/data/jenkins/workspace/soot/soot-master/src/main/java/soot/toolkits/scalar/AbstractFlowAnalysis.java:71: warning: no @return
  protected A entryInitialFlow() {
              ^
/data/jenkins/workspace/soot/soot-master/src/main/java/soot/toolkits/scalar/AbstractFlowAnalysis.java:78: warning: no @return
  protected boolean treatTrapHandlersAsEntries() {
                    ^
/data/jenkins/workspace/soot/soot-master/src/main/java/soot/toolkits/scalar/AbstractFlowAnalysis.java:83: warning: no @return
  protected abstract boolean isForward();
                             ^
/data/jenkins/workspace/soot/soot-master/src/main/java/soot/toolkits/scalar/AbstractFlowAnalysis.java:90: warning: no @param for in1
  protected abstract void merge(A in1, A in2, A out);
                          ^
/data/jenkins/workspace/soot/soot-master/src/main/java/soot/toolkits/scalar/AbstractFlowAnalysis.java:90: warning: no @param for in2
  protected abstract void merge(A in1, A in2, A out);
                          ^
/data/jenkins/workspace/soot/soot-master/src/main/java/soot/toolkits/scalar/AbstractFlowAnalysis.java:90: warning: no @param for out
  protected abstract void merge(A in1, A in2, A out);
                          ^
/data/jenkins/workspace/soot/soot-master/src/main/java/soot/toolkits/scalar/AbstractFlowAnalysis.java:96: warning: no @param for succNode
  protected void merge(N succNode, A in1, A in2, A out) {
                 ^
/data/jenkins/workspace/soot/soot-master/src/main/java/soot/toolkits/scalar/AbstractFlowAnalysis.java:96: warning: no @param for in1
  protected void merge(N succNode, A in1, A in2, A out) {
                 ^
/data/jenkins/workspace/soot/soot-master/src/main/java/soot/toolkits/scalar/AbstractFlowAnalysis.java:96: warning: no @param for in2
  protected void merge(N succNode, A in1, A in2, A out) {
                 ^
/data/jenkins/workspace/soot/soot-master/src/main/java/soot/toolkits/scalar/AbstractFlowAnalysis.java:96: warning: no @param for out
  protected void merge(N succNode, A in1, A in2, A out) {
                 ^
/data/jenkins/workspace/soot/soot-master/src/main/java/soot/toolkits/scalar/AbstractFlowAnalysis.java:101: warning: no @param for source
  protected abstract void copy(A source, A dest);
                          ^
/data/jenkins/workspace/soot/soot-master/src/main/java/soot/toolkits/scalar/AbstractFlowAnalysis.java:101: warning: no @param for dest
  protected abstract void copy(A source, A dest);
                          ^
/data/jenkins/workspace/soot/soot-master/src/main/java/soot/toolkits/scalar/AbstractFlowAnalysis.java:109: warning: no @param for s
  public A getFlowBefore(N s) {
           ^
/data/jenkins/workspace/soot/soot-master/src/main/java/soot/toolkits/scalar/AbstractFlowAnalysis.java:109: warning: no @return
  public A getFlowBefore(N s) {
           ^
/data/jenkins/workspace/soot/soot-master/src/main/java/soot/toolkits/scalar/AbstractFlowAnalysis.java:116: warning: no @param for succNode
  protected void mergeInto(N succNode, A inout, A in) {
                 ^
/data/jenkins/workspace/soot/soot-master/src/main/java/soot/toolkits/scalar/AbstractFlowAnalysis.java:116: warning: no @param for inout
  protected void mergeInto(N succNode, A inout, A in) {
                 ^
/data/jenkins/workspace/soot/soot-master/src/main/java/soot/toolkits/scalar/AbstractFlowAnalysis.java:116: warning: no @param for in
  protected void mergeInto(N succNode, A inout, A in) {
                 ^
/data/jenkins/workspace/soot/soot-master/src/main/java/soot/toolkits/scalar/BoundedFlowSet.java:41: warning: no @param for dest
  public void complement(FlowSet<T> dest);
              ^
/data/jenkins/workspace/soot/soot-master/src/main/java/soot/toolkits/scalar/BoundedFlowSet.java:46: warning: no @return
  public FlowSet<T> topSet();
                    ^
/data/jenkins/workspace/soot/soot-master/src/main/java/soot/toolkits/scalar/FlowSet.java:40: warning: no @return
  public FlowSet<T> clone();
                    ^
/data/jenkins/workspace/soot/soot-master/src/main/java/soot/toolkits/scalar/FlowSet.java:45: warning: no @return
  public FlowSet<T> emptySet();
                    ^
/data/jenkins/workspace/soot/soot-master/src/main/java/soot/toolkits/scalar/FlowSet.java:50: warning: no @param for dest
  public void copy(FlowSet<T> dest);
              ^
/data/jenkins/workspace/soot/soot-master/src/main/java/soot/toolkits/scalar/FlowSet.java:60: warning: no @param for other
  public void union(FlowSet<T> other);
              ^
/data/jenkins/workspace/soot/soot-master/src/main/java/soot/toolkits/scalar/FlowSet.java:66: warning: no @param for other
  public void union(FlowSet<T> other, FlowSet<T> dest);
              ^
/data/jenkins/workspace/soot/soot-master/src/main/java/soot/toolkits/scalar/FlowSet.java:66: warning: no @param for dest
  public void union(FlowSet<T> other, FlowSet<T> dest);
              ^
/data/jenkins/workspace/soot/soot-master/src/main/java/soot/toolkits/scalar/FlowSet.java:71: warning: no @param for other
  public void intersection(FlowSet<T> other);
              ^
/data/jenkins/workspace/soot/soot-master/src/main/java/soot/toolkits/scalar/FlowSet.java:77: warning: no @param for other
  public void intersection(FlowSet<T> other, FlowSet<T> dest);
              ^
/data/jenkins/workspace/soot/soot-master/src/main/java/soot/toolkits/scalar/FlowSet.java:77: warning: no @param for dest
  public void intersection(FlowSet<T> other, FlowSet<T> dest);
              ^
/data/jenkins/workspace/soot/soot-master/src/main/java/soot/toolkits/scalar/FlowSet.java:83: warning: no @param for other
  public void difference(FlowSet<T> other);
              ^
/data/jenkins/workspace/soot/soot-master/src/main/java/soot/toolkits/scalar/FlowSet.java:89: warning: no @param for other
  public void difference(FlowSet<T> other, FlowSet<T> dest);
              ^
/data/jenkins/workspace/soot/soot-master/src/main/java/soot/toolkits/scalar/FlowSet.java:89: warning: no @param for dest
  public void difference(FlowSet<T> other, FlowSet<T> dest);
              ^
/data/jenkins/workspace/soot/soot-master/src/main/java/soot/toolkits/scalar/FlowSet.java:94: warning: no @return
  public boolean isEmpty();
                 ^
/data/jenkins/workspace/soot/soot-master/src/main/java/soot/toolkits/scalar/FlowSet.java:101: warning: no @return
  public int size();
             ^
/data/jenkins/workspace/soot/soot-master/src/main/java/soot/toolkits/scalar/FlowSet.java:106: warning: no @param for obj
  public void add(T obj);
              ^
/data/jenkins/workspace/soot/soot-master/src/main/java/soot/toolkits/scalar/FlowSet.java:111: warning: no @param for obj
  public void add(T obj, FlowSet<T> dest);
              ^
/data/jenkins/workspace/soot/soot-master/src/main/java/soot/toolkits/scalar/FlowSet.java:111: warning: no @param for dest
  public void add(T obj, FlowSet<T> dest);
              ^
/data/jenkins/workspace/soot/soot-master/src/main/java/soot/toolkits/scalar/FlowSet.java:116: warning: no @param for obj
  public void remove(T obj);
              ^
/data/jenkins/workspace/soot/soot-master/src/main/java/soot/toolkits/scalar/FlowSet.java:121: warning: no @param for obj
  public void remove(T obj, FlowSet<T> dest);
              ^
/data/jenkins/workspace/soot/soot-master/src/main/java/soot/toolkits/scalar/FlowSet.java:121: warning: no @param for dest
  public void remove(T obj, FlowSet<T> dest);
              ^
/data/jenkins/workspace/soot/soot-master/src/main/java/soot/toolkits/scalar/FlowSet.java:126: warning: no @param for obj
  public boolean contains(T obj);
                 ^
/data/jenkins/workspace/soot/soot-master/src/main/java/soot/toolkits/scalar/FlowSet.java:126: warning: no @return
  public boolean contains(T obj);
                 ^
/data/jenkins/workspace/soot/soot-master/src/main/java/soot/toolkits/scalar/FlowSet.java:131: warning: no @param for other
  public boolean isSubSet(FlowSet<T> other);
                 ^
/data/jenkins/workspace/soot/soot-master/src/main/java/soot/toolkits/scalar/FlowSet.java:131: warning: no @return
  public boolean isSubSet(FlowSet<T> other);
                 ^
/data/jenkins/workspace/soot/soot-master/src/main/java/soot/toolkits/scalar/FlowSet.java:142: warning: no @return
  public List<T> toList();
                 ^
/data/jenkins/workspace/soot/soot-master/src/main/java/soot/toolkits/scalar/AbstractFlowAnalysis.java:53: warning: no @param for graph
  public AbstractFlowAnalysis(DirectedGraph<N> graph) {
         ^
/data/jenkins/workspace/soot/soot-master/src/main/java/soot/toolkits/scalar/BackwardFlowAnalysis.java:34: warning: no @param for graph
  public BackwardFlowAnalysis(DirectedGraph<N> graph) {
         ^
/data/jenkins/workspace/soot/soot-master/src/main/java/soot/toolkits/scalar/BinaryIdentitySet.java:26: error: reference not found
 * An optimized kind of {@link IdentityHashSet} that only holds two objects. (Allows for faster comparison.)
                               ^
/data/jenkins/workspace/soot/soot-master/src/main/java/soot/toolkits/scalar/BoundedFlowSet.java:29: error: unexpected content
 * @see: FlowUniverse
   ^
/data/jenkins/workspace/soot/soot-master/src/main/java/soot/toolkits/scalar/BranchedFlowAnalysis.java:55: warning: no @param for in
  protected abstract void flowThrough(A in, Unit s, List<A> fallOut, List<A> branchOuts);
                          ^
/data/jenkins/workspace/soot/soot-master/src/main/java/soot/toolkits/scalar/BranchedFlowAnalysis.java:55: warning: no @param for s
  protected abstract void flowThrough(A in, Unit s, List<A> fallOut, List<A> branchOuts);
                          ^
/data/jenkins/workspace/soot/soot-master/src/main/java/soot/toolkits/scalar/BranchedFlowAnalysis.java:55: warning: no @param for fallOut
  protected abstract void flowThrough(A in, Unit s, List<A> fallOut, List<A> branchOuts);
                          ^
/data/jenkins/workspace/soot/soot-master/src/main/java/soot/toolkits/scalar/BranchedFlowAnalysis.java:55: warning: no @param for branchOuts
  protected abstract void flowThrough(A in, Unit s, List<A> fallOut, List<A> branchOuts);
                          ^
/data/jenkins/workspace/soot/soot-master/src/main/java/soot/toolkits/scalar/ConstantInitializerToTagTransformer.java:84: error: unknown tag: clinit
   * Transforms the given class, i.e. scans for a <clinit> method and generates new constant value tags for all constant
                                                  ^
/data/jenkins/workspace/soot/soot-master/src/main/java/soot/toolkits/scalar/ConstantInitializerToTagTransformer.java:90: error: unknown tag: clinit
   *          True if the assignments inside the <clinit> method shall be removed, otherwise false
                                                 ^
/data/jenkins/workspace/soot/soot-master/src/main/java/soot/toolkits/scalar/ConstantInitializerToTagTransformer.java:62: error: unknown tag: clinit
 * This is the reverse operation of the {@link ConstantValueToInitializerTransformer}. We scan for <clinit> methods that
                                                                                                   ^
/data/jenkins/workspace/soot/soot-master/src/main/java/soot/toolkits/scalar/ConstantInitializerToTagTransformer.java:64: error: unknown tag: clinit
 * assignment in the <clinit> method is removed. If <clinit> runs empty, it is deleted as well.
                     ^
/data/jenkins/workspace/soot/soot-master/src/main/java/soot/toolkits/scalar/ConstantInitializerToTagTransformer.java:64: error: unknown tag: clinit
 * assignment in the <clinit> method is removed. If <clinit> runs empty, it is deleted as well.
                                                    ^
/data/jenkins/workspace/soot/soot-master/src/main/java/soot/toolkits/scalar/FastColorer.java:54: warning: no @param for unitBody
  public static void unsplitAssignColorsToLocals(Body unitBody, Map<Local, Object> localToGroup,
                     ^
/data/jenkins/workspace/soot/soot-master/src/main/java/soot/toolkits/scalar/FastColorer.java:54: warning: no @param for localToGroup
  public static void unsplitAssignColorsToLocals(Body unitBody, Map<Local, Object> localToGroup,
                     ^
/data/jenkins/workspace/soot/soot-master/src/main/java/soot/toolkits/scalar/FastColorer.java:54: warning: no @param for localToColor
  public static void unsplitAssignColorsToLocals(Body unitBody, Map<Local, Object> localToGroup,
                     ^
/data/jenkins/workspace/soot/soot-master/src/main/java/soot/toolkits/scalar/FastColorer.java:54: warning: no @param for groupToColorCount
  public static void unsplitAssignColorsToLocals(Body unitBody, Map<Local, Object> localToGroup,
                     ^
/data/jenkins/workspace/soot/soot-master/src/main/java/soot/toolkits/scalar/FastColorer.java:168: warning: no @param for unitBody
  public static void assignColorsToLocals(Body unitBody, Map<Local, Object> localToGroup, Map<Local, Integer> localToColor,
                     ^
/data/jenkins/workspace/soot/soot-master/src/main/java/soot/toolkits/scalar/FastColorer.java:168: warning: no @param for localToGroup
  public static void assignColorsToLocals(Body unitBody, Map<Local, Object> localToGroup, Map<Local, Integer> localToColor,
                     ^
/data/jenkins/workspace/soot/soot-master/src/main/java/soot/toolkits/scalar/FastColorer.java:168: warning: no @param for localToColor
  public static void assignColorsToLocals(Body unitBody, Map<Local, Object> localToGroup, Map<Local, Integer> localToColor,
                     ^
/data/jenkins/workspace/soot/soot-master/src/main/java/soot/toolkits/scalar/FastColorer.java:168: warning: no @param for groupToColorCount
  public static void assignColorsToLocals(Body unitBody, Map<Local, Object> localToGroup, Map<Local, Integer> localToColor,
                     ^
/data/jenkins/workspace/soot/soot-master/src/main/java/soot/toolkits/scalar/FlowAnalysis.java:410: warning: no @param for graph
  public FlowAnalysis(DirectedGraph<N> graph) {
         ^
/data/jenkins/workspace/soot/soot-master/src/main/java/soot/toolkits/scalar/FlowSet.java:34: error: unexpected content
 * @see: FlowUniverse
   ^
/data/jenkins/workspace/soot/soot-master/src/main/java/soot/toolkits/scalar/ForwardFlowAnalysis.java:35: warning: no @param for graph
  public ForwardFlowAnalysis(DirectedGraph<N> graph) {
         ^
/data/jenkins/workspace/soot/soot-master/src/main/java/soot/toolkits/scalar/ForwardFlowAnalysisExtended.java:78: warning: no @return
  protected abstract A newInitialFlow();
                       ^
/data/jenkins/workspace/soot/soot-master/src/main/java/soot/toolkits/scalar/ForwardFlowAnalysisExtended.java:83: warning: no @return
  protected abstract A entryInitialFlow();
                       ^
/data/jenkins/workspace/soot/soot-master/src/main/java/soot/toolkits/scalar/ForwardFlowAnalysisExtended.java:86: warning: no @param for source
  protected abstract void copy(A source, A dest);
                          ^
/data/jenkins/workspace/soot/soot-master/src/main/java/soot/toolkits/scalar/ForwardFlowAnalysisExtended.java:86: warning: no @param for dest
  protected abstract void copy(A source, A dest);
                          ^
/data/jenkins/workspace/soot/soot-master/src/main/java/soot/toolkits/scalar/ForwardFlowAnalysisExtended.java:93: warning: no @param for in1
  protected abstract void merge(A in1, A in2, A out);
                          ^
/data/jenkins/workspace/soot/soot-master/src/main/java/soot/toolkits/scalar/ForwardFlowAnalysisExtended.java:93: warning: no @param for in2
  protected abstract void merge(A in1, A in2, A out);
                          ^
/data/jenkins/workspace/soot/soot-master/src/main/java/soot/toolkits/scalar/ForwardFlowAnalysisExtended.java:93: warning: no @param for out
  protected abstract void merge(A in1, A in2, A out);
                          ^
/data/jenkins/workspace/soot/soot-master/src/main/java/soot/toolkits/scalar/ForwardFlowAnalysisExtended.java:99: warning: no @param for succNode
  protected void merge(N succNode, A in1, A in2, A out) {
                 ^
/data/jenkins/workspace/soot/soot-master/src/main/java/soot/toolkits/scalar/ForwardFlowAnalysisExtended.java:99: warning: no @param for in1
  protected void merge(N succNode, A in1, A in2, A out) {
                 ^
/data/jenkins/workspace/soot/soot-master/src/main/java/soot/toolkits/scalar/ForwardFlowAnalysisExtended.java:99: warning: no @param for in2
  protected void merge(N succNode, A in1, A in2, A out) {
                 ^
/data/jenkins/workspace/soot/soot-master/src/main/java/soot/toolkits/scalar/ForwardFlowAnalysisExtended.java:99: warning: no @param for out
  protected void merge(N succNode, A in1, A in2, A out) {
                 ^
/data/jenkins/workspace/soot/soot-master/src/main/java/soot/toolkits/scalar/ForwardFlowAnalysisExtended.java:106: warning: no @param for succNode
  protected void mergeInto(N succNode, A inout, A in) {
                 ^
/data/jenkins/workspace/soot/soot-master/src/main/java/soot/toolkits/scalar/ForwardFlowAnalysisExtended.java:106: warning: no @param for inout
  protected void mergeInto(N succNode, A inout, A in) {
                 ^
/data/jenkins/workspace/soot/soot-master/src/main/java/soot/toolkits/scalar/ForwardFlowAnalysisExtended.java:106: warning: no @param for in
  protected void mergeInto(N succNode, A inout, A in) {
                 ^
/data/jenkins/workspace/soot/soot-master/src/main/java/soot/toolkits/scalar/ForwardFlowAnalysisExtended.java:220: warning: no @param for s
  public A getFlowBefore(N s) {
           ^
/data/jenkins/workspace/soot/soot-master/src/main/java/soot/toolkits/scalar/ForwardFlowAnalysisExtended.java:220: warning: no @return
  public A getFlowBefore(N s) {
           ^
/data/jenkins/workspace/soot/soot-master/src/main/java/soot/toolkits/scalar/ForwardFlowAnalysisExtended.java:60: warning: no @param for graph
  public ForwardFlowAnalysisExtended(DirectedGraph<N> graph) {
         ^
/data/jenkins/workspace/soot/soot-master/src/main/java/soot/toolkits/scalar/GuaranteedDefs.java:74: warning: no @param for s
  public List getGuaranteedDefs(Unit s) {
              ^
/data/jenkins/workspace/soot/soot-master/src/main/java/soot/toolkits/scalar/GuaranteedDefs.java:74: warning: no @return
  public List getGuaranteedDefs(Unit s) {
              ^
/data/jenkins/workspace/soot/soot-master/src/main/java/soot/toolkits/scalar/LocalDefs.java:47: warning: no description for @param
     * @param body
       ^
/data/jenkins/workspace/soot/soot-master/src/main/java/soot/toolkits/scalar/LocalDefs.java:60: error: @param name not found
     * @param expectUndefinedUses
              ^
/data/jenkins/workspace/soot/soot-master/src/main/java/soot/toolkits/scalar/LocalPacker.java:53: error: malformed HTML
 * for(int i; i < k; i++); for(int j; j < k; j++);
                ^
/data/jenkins/workspace/soot/soot-master/src/main/java/soot/toolkits/scalar/LocalPacker.java:53: error: malformed HTML
 * for(int i; i < k; i++); for(int j; j < k; j++);
                                        ^
/data/jenkins/workspace/soot/soot-master/src/main/java/soot/toolkits/scalar/LocalPacker.java:55: error: malformed HTML
 * would be transformed into: for(int i; i < k; i++); for(int i; i < k; i++);
                                           ^
/data/jenkins/workspace/soot/soot-master/src/main/java/soot/toolkits/scalar/LocalPacker.java:55: error: malformed HTML
 * would be transformed into: for(int i; i < k; i++); for(int i; i < k; i++);
                                                                   ^
/data/jenkins/workspace/soot/soot-master/src/main/java/soot/toolkits/scalar/LocalSplitter.java:57: error: malformed HTML
 * for(int i; i < k; i++); for(int i; i < k; i++);
                ^
/data/jenkins/workspace/soot/soot-master/src/main/java/soot/toolkits/scalar/LocalSplitter.java:57: error: malformed HTML
 * for(int i; i < k; i++); for(int i; i < k; i++);
                                        ^
/data/jenkins/workspace/soot/soot-master/src/main/java/soot/toolkits/scalar/LocalSplitter.java:59: error: malformed HTML
 * would be transformed into: for(int i; i < k; i++); for(int j; j < k; j++);
                                           ^
/data/jenkins/workspace/soot/soot-master/src/main/java/soot/toolkits/scalar/LocalSplitter.java:59: error: malformed HTML
 * would be transformed into: for(int i; i < k; i++); for(int j; j < k; j++);
                                                                   ^
/data/jenkins/workspace/soot/soot-master/src/main/java/soot/toolkits/scalar/SmartLocalDefs.java:53: error: no tag name after @
 * should use {@see SimpleLocalDefs}.
              ^
/data/jenkins/workspace/soot/soot-master/src/main/java/soot/toolkits/scalar/SmartLocalDefs.java:55: error: no tag name after @
 * Be warned: This implementation requires a lot of memory and CPU time, normally {@see SimpleLocalDefs} is much faster.
                                                                                  ^
/data/jenkins/workspace/soot/soot-master/src/main/java/soot/toolkits/scalar/UnitValueBoxPair.java:38: error: @param name not found
   * @param local
            ^
/data/jenkins/workspace/soot/soot-master/src/main/java/soot/toolkits/exceptions/ThrowableSet.java:204: error: unexpected text
   * @throws {@link
     ^
/data/jenkins/workspace/soot/soot-master/src/main/java/soot/toolkits/exceptions/ThrowableSet.java:860: error: text not allowed in <ul> element
   * @return An abbreviated representation of the contents of this set.
             ^
/data/jenkins/workspace/soot/soot-master/src/main/java/soot/toolkits/exceptions/ThrowableSet.java:848: error: element not closed: ul
   * <ul>
     ^
/data/jenkins/workspace/soot/soot-master/src/main/java/soot/toolkits/exceptions/ThrowableSet.java:72: error: unexpected end tag: </p>
 * </p>
   ^
/data/jenkins/workspace/soot/soot-master/src/main/java/soot/toolkits/exceptions/TrapTightener.java:154: error: malformed HTML
   * @return <tt>true</tt> if <tt>u</tt> might throw an exception caught by <tt>t</tt>, according to <tt>g</tt.
                                                                                                          ^
/data/jenkins/workspace/soot/soot-master/src/main/java/soot/toolkits/exceptions/TrapTightener.java:154: error: element not closed: tt
   * @return <tt>true</tt> if <tt>u</tt> might throw an exception caught by <tt>t</tt>, according to <tt>g</tt.
                                                                                                     ^
/data/jenkins/workspace/soot/soot-master/src/main/java/soot/toolkits/graph/ArrayRefBlockGraph.java:78: error: unexpected text
   * This implementation chooses as block leaders all the <tt>Unit</tt>s that {@link BlockGraph.computerLeaders()}, and adds:
                                                                              ^
/data/jenkins/workspace/soot/soot-master/src/main/java/soot/toolkits/graph/ArrayRefBlockGraph.java:82: error: unexpected text
   * <li>All <tt>Unit</tt>s which contain an array reference, as defined by {@link Stmt.containsArrayRef()} and
                                                                            ^
/data/jenkins/workspace/soot/soot-master/src/main/java/soot/toolkits/graph/ArrayRefBlockGraph.java:83: error: unexpected text
   * {@link Inst.containsArrayRef()}.
     ^
/data/jenkins/workspace/soot/soot-master/src/main/java/soot/toolkits/graph/ArrayRefBlockGraph.java:86: error: unexpected text
   * {@link Trap.getLastUnit()}.</li>
     ^
/data/jenkins/workspace/soot/soot-master/src/main/java/soot/toolkits/graph/ArrayRefBlockGraph.java:89: error: unexpected end tag: </p>
   * </p>
     ^
/data/jenkins/workspace/soot/soot-master/src/main/java/soot/toolkits/graph/BlockGraph.java:102: error: unexpected end tag: </p>
   * </p>
     ^
/data/jenkins/workspace/soot/soot-master/src/main/java/soot/toolkits/graph/ArrayRefBlockGraph.java:51: error: @param name not found
   * @param the
            ^
/data/jenkins/workspace/soot/soot-master/src/main/java/soot/toolkits/graph/BlockGraph.java:50: error: reference not found
 * <code>BlockGraph</code>'s definition of {@link computeLeaders()}.
                                                  ^
/data/jenkins/workspace/soot/soot-master/src/main/java/soot/toolkits/graph/ClassicCompleteUnitGraph.java:62: error: end tag missing: </tt>
 * parameters passed to the <tt>ExceptionalUnitGraph<tt> constructor.
                                                    ^
/data/jenkins/workspace/soot/soot-master/src/main/java/soot/toolkits/graph/ClassicCompleteUnitGraph.java:62: error: end tag missing: </tt>
 * parameters passed to the <tt>ExceptionalUnitGraph<tt> constructor.
                            ^
/data/jenkins/workspace/soot/soot-master/src/main/java/soot/toolkits/graph/ClassicCompleteUnitGraph.java:69: error: unexpected end tag: </p>
 * </p>
   ^
/data/jenkins/workspace/soot/soot-master/src/main/java/soot/toolkits/graph/ClassicCompleteUnitGraph.java:75: error: @param name not found
   * @param the
            ^
/data/jenkins/workspace/soot/soot-master/src/main/java/soot/toolkits/graph/ExceptionalBlockGraph.java:106: error: identifier expected
   * @param {@inheritDoc}
     ^
/data/jenkins/workspace/soot/soot-master/src/main/java/soot/toolkits/graph/CompleteBlockGraph.java:32: error: reference not found
 * <code>CompleteBlockGraph</code> assumes that every {@link Unit} covered by a {@link Trap} has the potential to throw an
                                                             ^
/data/jenkins/workspace/soot/soot-master/src/main/java/soot/toolkits/graph/CompleteBlockGraph.java:33: error: reference not found
 * exception caught by the {@link Trap}. This generally has the effect of separating every covered {@link Unit} into a
                                                                                                          ^
/data/jenkins/workspace/soot/soot-master/src/main/java/soot/toolkits/graph/ExceptionalUnitGraph.java:268: error: malformed HTML
   *         <code>Unit</code>'s exceptions escape the method, it will be mapped to <code>null</code, rather than to a
                                                                                              ^
/data/jenkins/workspace/soot/soot-master/src/main/java/soot/toolkits/graph/ExceptionalUnitGraph.java:268: error: end tag missing: </code>
   *         <code>Unit</code>'s exceptions escape the method, it will be mapped to <code>null</code, rather than to a
                                                                                    ^
/data/jenkins/workspace/soot/soot-master/src/main/java/soot/toolkits/graph/ExceptionalUnitGraph.java:611: error: end tag missing: </code>
   * and to document the conditions under which <code>ExceptionalUnitGraph considers a node to be a head or
                                                ^
/data/jenkins/workspace/soot/soot-master/src/main/java/soot/toolkits/graph/CompleteUnitGraph.java:56: error: unexpected end tag: </p>
 * </p>
   ^
/data/jenkins/workspace/soot/soot-master/src/main/java/soot/toolkits/graph/CytronDominanceFrontier.java:103: error: malformed HTML
   *      DF(X) < - null
                ^
/data/jenkins/workspace/soot/soot-master/src/main/java/soot/toolkits/graph/CytronDominanceFrontier.java:105: error: malformed HTML
   *        if (idom(Y)!=X) then DF(X) <- DF(X) U Y
                                       ^
/data/jenkins/workspace/soot/soot-master/src/main/java/soot/toolkits/graph/CytronDominanceFrontier.java:109: error: malformed HTML
   *              if (idom(Y)!=X) then DF(X) <- DF(X) U Y
                                             ^
/data/jenkins/workspace/soot/soot-master/src/main/java/soot/toolkits/graph/ExceptionalGraph.java:77: error: ')' missing in reference
     * node that includes {@link trap().getBeginUnit()}).
                          ^
/data/jenkins/workspace/soot/soot-master/src/main/java/soot/toolkits/graph/PseudoTopologicalOrderer.java:166: error: unterminated signature
   * @deprecated use {@link #newList(DirectedGraph, boolean))} instead
                     ^
/data/jenkins/workspace/soot/soot-master/src/main/java/soot/toolkits/graph/PseudoTopologicalOrderer.java:176: error: @param name not found
   * @param isReverse
            ^
/data/jenkins/workspace/soot/soot-master/src/main/java/soot/toolkits/graph/PseudoTopologicalOrderer.java:178: error: unterminated signature
   * @deprecated use {@link #newList(DirectedGraph, boolean))} instead
                     ^
/data/jenkins/workspace/soot/soot-master/src/main/java/soot/toolkits/graph/PseudoTopologicalOrderer.java:189: error: unterminated signature
   * @deprecated use {@link #newList(DirectedGraph, boolean))} instead
                     ^
/data/jenkins/workspace/soot/soot-master/src/main/java/soot/toolkits/graph/SlowPseudoTopologicalOrderer.java:307: error: unterminated signature
   * @deprecated use {@link #newList(DirectedGraph, boolean))} instead
                     ^
/data/jenkins/workspace/soot/soot-master/src/main/java/soot/toolkits/graph/SlowPseudoTopologicalOrderer.java:317: error: @param name not found
   * @param isReverse
            ^
/data/jenkins/workspace/soot/soot-master/src/main/java/soot/toolkits/graph/SlowPseudoTopologicalOrderer.java:319: error: unterminated signature
   * @deprecated use {@link #newList(DirectedGraph, boolean))} instead
                     ^
/data/jenkins/workspace/soot/soot-master/src/main/java/soot/toolkits/graph/SlowPseudoTopologicalOrderer.java:330: error: unterminated signature
   * @deprecated use {@link #newList(DirectedGraph, boolean))} instead
                     ^
/data/jenkins/workspace/soot/soot-master/src/main/java/soot/toolkits/graph/SlowPseudoTopologicalOrderer.java:39: error: unexpected content
 * @see: PseudoTopologicalOrderer
   ^
/data/jenkins/workspace/soot/soot-master/src/main/java/soot/toolkits/graph/TrapUnitGraph.java:66: error: @param name not found
   * @param the
            ^
/data/jenkins/workspace/soot/soot-master/src/main/java/soot/toolkits/graph/ZonedBlockGraph.java:80: error: unexpected text
   * This implementation chooses as block leaders all the <tt>Unit</tt>s that {@link BlockGraph.computerLeaders()}, and adds:
                                                                              ^
/data/jenkins/workspace/soot/soot-master/src/main/java/soot/toolkits/graph/ZonedBlockGraph.java:85: error: unexpected text
   * {@link Trap.getBeginUnit()}.</li>
     ^
/data/jenkins/workspace/soot/soot-master/src/main/java/soot/toolkits/graph/ZonedBlockGraph.java:88: error: unexpected text
   * {@link Trap.getEndUnit()}.</li>
     ^
/data/jenkins/workspace/soot/soot-master/src/main/java/soot/toolkits/graph/ZonedBlockGraph.java:91: error: unexpected end tag: </p>
   * </p>
     ^
/data/jenkins/workspace/soot/soot-master/src/main/java/soot/toolkits/graph/ZonedBlockGraph.java:35: error: malformed HTML
 * handler will start a new Block, and any <ttUnit</tt> which is the last <tt>Unit</tt> to be covered a some exception
                                           ^
/data/jenkins/workspace/soot/soot-master/src/main/java/soot/toolkits/graph/ZonedBlockGraph.java:35: error: unexpected end tag: </tt>
 * handler will start a new Block, and any <ttUnit</tt> which is the last <tt>Unit</tt> to be covered a some exception
                                                  ^
/data/jenkins/workspace/soot/soot-master/src/main/java/soot/toolkits/graph/pdg/HashMutablePDG.java:617: error: @param name not found
   * @param The
            ^
/data/jenkins/workspace/soot/soot-master/src/main/java/soot/toolkits/graph/pdg/PDGRegion.java:256: error: @param name not found
   * @param a
            ^
/data/jenkins/workspace/soot/soot-master/src/main/java/soot/Unit.java:85: error: reference not found
   * @see soot.shimple.Shimple#redirectToPreds(Chain, Unit)
          ^
/data/jenkins/workspace/soot/soot-master/src/main/java/soot/AbstractASMBackend.java:502: error: @param name not found
   * @param fv
            ^
/data/jenkins/workspace/soot/soot-master/src/main/java/soot/AbstractASMBackend.java:504: error: @param name not found
   * @param f
            ^
/data/jenkins/workspace/soot/soot-master/src/main/java/soot/PolymorphicMethodRef.java:50: error: no tag name after @
   * {@see http://docs.oracle.com/javase/specs/jls/se11/html/jls-15.html#jls-15.12.4.4}
     ^
/data/jenkins/workspace/soot/soot-master/src/main/java/soot/PolymorphicMethodRef.java:32: error: reference not found
 * {@link java.lang.invoke.VarHandle}. As described in
          ^
/data/jenkins/workspace/soot/soot-master/src/main/java/soot/Scene.java:1151: error: bad HTML entity
   * Returns a chain of the application classes in this scene. These classes are the ones which can be freely analysed &
                                                                                                                       ^
/data/jenkins/workspace/soot/soot-master/src/main/java/soot/SootMethod.java:570: error: unknown tag: clinit
   * @return yes, if this function is a constructor. Please not that <clinit> methods are not treated as constructors in this
                                                                     ^
/data/jenkins/workspace/soot/soot-master/src/main/java/soot/SourceLocator.java:555: error: ')' missing in reference
   * If {@link Options#v()#output_jar()} is set, returns the name of the jar file to which the output will be written. The
        ^
/data/jenkins/workspace/soot/soot-master/src/main/java/soot/UnitPatchingChain.java:36: error: unknown tag: X
 * PatchingChain<X extends Unit> is not allowed to contain such new statements, since they are not a subclass of X.
                ^
/data/jenkins/workspace/soot/soot-master/src/main/java/soot/asm/AsmClassSource.java:49: error: @param name not found
   * @param data
            ^
/data/jenkins/workspace/soot/soot-master/src/main/java/soot/jimple/Jimple.java:114: error: bad use of '>'
 * Immediate -> Local | Constant <br>
              ^
/data/jenkins/workspace/soot/soot-master/src/main/java/soot/jimple/Jimple.java:115: error: bad use of '>'
 * RValue -> Local | Constant | ConcreteRef | Expr<br>
           ^
/data/jenkins/workspace/soot/soot-master/src/main/java/soot/jimple/Jimple.java:116: error: bad use of '>'
 * Variable -> Local | ArrayRef | InstanceFieldRef | StaticFieldRef <br>
             ^
/data/jenkins/workspace/soot/soot-master/src/main/java/soot/jimple/JimpleBody.java:126: error: bad HTML entity
  /** Inserts usual statements for handling this & parameters into body. */
                                                 ^
/data/jenkins/workspace/soot/soot-master/src/main/java/soot/jimple/JimpleBody.java:132: error: bad HTML entity
   * Inserts usual statements for handling this & parameters into body.
                                                ^
/data/jenkins/workspace/soot/soot-master/src/main/java/soot/jimple/toolkits/invoke/SynchronizerManager.java:78: error: malformed HTML
          $r3 = <quack: java.lang.Class class$quack>;
                ^
/data/jenkins/workspace/soot/soot-master/src/main/java/soot/jimple/toolkits/invoke/SynchronizerManager.java:78: error: bad use of '>'
          $r3 = <quack: java.lang.Class class$quack>;
                                                   ^
/data/jenkins/workspace/soot/soot-master/src/main/java/soot/jimple/toolkits/invoke/SynchronizerManager.java:81: error: malformed HTML
          $r3 = .staticinvoke <quack: java.lang.Class class$(java.lang.String)>("quack");
                              ^
/data/jenkins/workspace/soot/soot-master/src/main/java/soot/jimple/toolkits/invoke/SynchronizerManager.java:81: error: bad use of '>'
          $r3 = .staticinvoke <quack: java.lang.Class class$(java.lang.String)>("quack");
                                                                              ^
/data/jenkins/workspace/soot/soot-master/src/main/java/soot/jimple/toolkits/invoke/SynchronizerManager.java:82: error: malformed HTML
          <quack: java.lang.Class class$quack> = $r3;
          ^
/data/jenkins/workspace/soot/soot-master/src/main/java/soot/jimple/toolkits/invoke/SynchronizerManager.java:82: error: bad use of '>'
          <quack: java.lang.Class class$quack> = $r3;
                                             ^
/data/jenkins/workspace/soot/soot-master/src/main/java/soot/jimple/toolkits/invoke/SynchronizerManager.java:242: error: malformed HTML
               $r2 = .staticinvoke <java.lang.Class: java.lang.Class forName(java.lang.String)>(r0);
                                   ^
/data/jenkins/workspace/soot/soot-master/src/main/java/soot/jimple/toolkits/invoke/SynchronizerManager.java:242: error: bad use of '>'
               $r2 = .staticinvoke <java.lang.Class: java.lang.Class forName(java.lang.String)>(r0);
                                                                                              ^
/data/jenkins/workspace/soot/soot-master/src/main/java/soot/jimple/toolkits/invoke/SynchronizerManager.java:249: error: malformed HTML
               $r5 = .virtualinvoke r1.<java.lang.Throwable: java.lang.String getMessage()>();
                                       ^
/data/jenkins/workspace/soot/soot-master/src/main/java/soot/jimple/toolkits/invoke/SynchronizerManager.java:249: error: bad use of '>'
               $r5 = .virtualinvoke r1.<java.lang.Throwable: java.lang.String getMessage()>();
                                                                                          ^
/data/jenkins/workspace/soot/soot-master/src/main/java/soot/jimple/toolkits/invoke/SynchronizerManager.java:250: error: malformed HTML
               .specialinvoke $r4.<java.lang.NoClassDefFoundError: .void <init>(java.lang.String)>($r5);
                                  ^
/data/jenkins/workspace/soot/soot-master/src/main/java/soot/jimple/toolkits/invoke/SynchronizerManager.java:250: error: unknown tag: init
               .specialinvoke $r4.<java.lang.NoClassDefFoundError: .void <init>(java.lang.String)>($r5);
                                                                         ^
/data/jenkins/workspace/soot/soot-master/src/main/java/soot/jimple/toolkits/invoke/SynchronizerManager.java:250: error: bad use of '>'
               .specialinvoke $r4.<java.lang.NoClassDefFoundError: .void <init>(java.lang.String)>($r5);
                                                                                                 ^
/data/jenkins/workspace/soot/soot-master/src/main/java/soot/jimple/toolkits/invoke/ThrowManager.java:57: error: unknown tag: init
   * r928 = new java.lang.NullPointerException; specialinvoke r928."<init>"(); throw r928;
                                                                    ^
/data/jenkins/workspace/soot/soot-master/src/main/java/soot/jimple/toolkits/pointer/StrongLocalMustAliasAnalysis.java:40: error: reference not found
 * is redefined in a loop, the must-alias information is invalidated and set to {@link LocalMustAliasAnalysis#UNKNOWN}. E.g.
                                                                                       ^
/data/jenkins/workspace/soot/soot-master/src/main/java/soot/jimple/toolkits/pointer/nativemethods/JavaLangReflectArrayNative.java:81: error: unknown tag: param0
   * @param0[] = @param1
     ^

Command line was: /data/jenkins/tools/hudson.model.JDK/Oracle_JDK_8/jre/../bin/javadoc @options @packages

Refer to the generated Javadoc files in '/data/jenkins/workspace/soot/soot-master/target/apidocs' dir.

    at org.apache.maven.plugins.javadoc.AbstractJavadocMojo.executeJavadocCommandLine (AbstractJavadocMojo.java:5295)
    at org.apache.maven.plugins.javadoc.AbstractJavadocMojo.executeReport (AbstractJavadocMojo.java:2131)
    at org.apache.maven.plugins.javadoc.JavadocJar.doExecute (JavadocJar.java:190)
    at org.apache.maven.plugins.javadoc.AbstractJavadocMojo.execute (AbstractJavadocMojo.java:1909)
    at org.apache.maven.plugin.DefaultBuildPluginManager.executeMojo (DefaultBuildPluginManager.java:134)
    at org.apache.maven.lifecycle.internal.MojoExecutor.execute (MojoExecutor.java:208)
    at org.apache.maven.lifecycle.internal.MojoExecutor.execute (MojoExecutor.java:154)
    at org.apache.maven.lifecycle.internal.MojoExecutor.execute (MojoExecutor.java:146)
    at org.apache.maven.lifecycle.internal.LifecycleModuleBuilder.buildProject (LifecycleModuleBuilder.java:117)
    at org.apache.maven.lifecycle.internal.LifecycleModuleBuilder.buildProject (LifecycleModuleBuilder.java:81)
    at org.apache.maven.lifecycle.internal.builder.singlethreaded.SingleThreadedBuilder.build (SingleThreadedBuilder.java:51)
    at org.apache.maven.lifecycle.internal.LifecycleStarter.execute (LifecycleStarter.java:128)
    at org.apache.maven.DefaultMaven.doExecute (DefaultMaven.java:309)
    at org.apache.maven.DefaultMaven.doExecute (DefaultMaven.java:194)
    at org.apache.maven.DefaultMaven.execute (DefaultMaven.java:107)
    at org.jvnet.hudson.maven3.launcher.Maven35Launcher.main (Maven35Launcher.java:130)
    at sun.reflect.NativeMethodAccessorImpl.invoke0 (Native Method)
    at sun.reflect.NativeMethodAccessorImpl.invoke (NativeMethodAccessorImpl.java:62)
    at sun.reflect.DelegatingMethodAccessorImpl.invoke (DelegatingMethodAccessorImpl.java:43)
    at java.lang.reflect.Method.invoke (Method.java:498)
    at org.codehaus.plexus.classworlds.launcher.Launcher.launchEnhanced (Launcher.java:289)
    at org.codehaus.plexus.classworlds.launcher.Launcher.launch (Launcher.java:229)
    at jenkins.maven3.agent.Maven35Main.launch (Maven35Main.java:178)
    at sun.reflect.NativeMethodAccessorImpl.invoke0 (Native Method)
    at sun.reflect.NativeMethodAccessorImpl.invoke (NativeMethodAccessorImpl.java:62)
    at sun.reflect.DelegatingMethodAccessorImpl.invoke (DelegatingMethodAccessorImpl.java:43)
    at java.lang.reflect.Method.invoke (Method.java:498)
    at hudson.maven.Maven3Builder.call (Maven3Builder.java:139)
    at hudson.maven.Maven3Builder.call (Maven3Builder.java:70)
    at hudson.remoting.UserRequest.perform (UserRequest.java:212)
    at hudson.remoting.UserRequest.perform (UserRequest.java:54)
    at hudson.remoting.Request$2.run (Request.java:369)
    at hudson.remoting.InterceptingExecutorService$1.call (InterceptingExecutorService.java:72)
    at java.util.concurrent.FutureTask.run (FutureTask.java:266)
    at java.util.concurrent.ThreadPoolExecutor.runWorker (ThreadPoolExecutor.java:1149)
    at java.util.concurrent.ThreadPoolExecutor$Worker.run (ThreadPoolExecutor.java:624)
    at java.lang.Thread.run (Thread.java:748)
[INFO] Building jar: /data/jenkins/workspace/soot/soot-master/target/sootclasses-trunk-javadoc.jar
[INFO] 
[INFO] --- maven-checkstyle-plugin:3.0.0:check (stylecheck) @ soot ---
[INFO] Downloading from central: https://repo.maven.apache.org/maven2/com/puppycrawl/tools/checkstyle/8.18/checkstyle-8.18.pom
[INFO] Downloaded from central: https://repo.maven.apache.org/maven2/com/puppycrawl/tools/checkstyle/8.18/checkstyle-8.18.pom (126 kB at 4.5 MB/s)
[INFO] Downloading from central: https://repo.maven.apache.org/maven2/info/picocli/picocli/3.9.5/picocli-3.9.5.pom
[INFO] Downloaded from central: https://repo.maven.apache.org/maven2/info/picocli/picocli/3.9.5/picocli-3.9.5.pom (1.4 kB at 68 kB/s)
[INFO] Downloading from central: https://repo.maven.apache.org/maven2/antlr/antlr/2.7.7/antlr-2.7.7.pom
[INFO] Downloaded from central: https://repo.maven.apache.org/maven2/antlr/antlr/2.7.7/antlr-2.7.7.pom (632 B at 26 kB/s)
[INFO] Downloading from central: https://repo.maven.apache.org/maven2/org/antlr/antlr4-runtime/4.7.2/antlr4-runtime-4.7.2.pom
[INFO] Downloaded from central: https://repo.maven.apache.org/maven2/org/antlr/antlr4-runtime/4.7.2/antlr4-runtime-4.7.2.pom (3.6 kB at 172 kB/s)
[INFO] Downloading from central: https://repo.maven.apache.org/maven2/org/antlr/antlr4-master/4.7.2/antlr4-master-4.7.2.pom
[INFO] Downloaded from central: https://repo.maven.apache.org/maven2/org/antlr/antlr4-master/4.7.2/antlr4-master-4.7.2.pom (4.4 kB at 210 kB/s)
[INFO] Downloading from central: https://repo.maven.apache.org/maven2/commons-beanutils/commons-beanutils/1.9.3/commons-beanutils-1.9.3.pom
[INFO] Downloaded from central: https://repo.maven.apache.org/maven2/commons-beanutils/commons-beanutils/1.9.3/commons-beanutils-1.9.3.pom (15 kB at 542 kB/s)
[INFO] Downloading from central: https://repo.maven.apache.org/maven2/commons-collections/commons-collections/3.2.2/commons-collections-3.2.2.pom
[INFO] Downloaded from central: https://repo.maven.apache.org/maven2/commons-collections/commons-collections/3.2.2/commons-collections-3.2.2.pom (12 kB at 428 kB/s)
[INFO] Downloading from central: https://repo.maven.apache.org/maven2/com/google/guava/guava/27.0.1-jre/guava-27.0.1-jre.pom
[INFO] Downloaded from central: https://repo.maven.apache.org/maven2/com/google/guava/guava/27.0.1-jre/guava-27.0.1-jre.pom (8.3 kB at 394 kB/s)
[INFO] Downloading from central: https://repo.maven.apache.org/maven2/com/google/guava/guava-parent/27.0.1-jre/guava-parent-27.0.1-jre.pom
[INFO] Downloaded from central: https://repo.maven.apache.org/maven2/com/google/guava/guava-parent/27.0.1-jre/guava-parent-27.0.1-jre.pom (10 kB at 495 kB/s)
[INFO] Downloading from central: https://repo.maven.apache.org/maven2/com/google/guava/failureaccess/1.0.1/failureaccess-1.0.1.pom
[INFO] Downloaded from central: https://repo.maven.apache.org/maven2/com/google/guava/failureaccess/1.0.1/failureaccess-1.0.1.pom (2.4 kB at 115 kB/s)
[INFO] Downloading from central: https://repo.maven.apache.org/maven2/com/google/guava/guava-parent/26.0-android/guava-parent-26.0-android.pom
[INFO] Downloaded from central: https://repo.maven.apache.org/maven2/com/google/guava/guava-parent/26.0-android/guava-parent-26.0-android.pom (10 kB at 485 kB/s)
[INFO] Downloading from central: https://repo.maven.apache.org/maven2/com/google/guava/listenablefuture/9999.0-empty-to-avoid-conflict-with-guava/listenablefuture-9999.0-empty-to-avoid-conflict-with-guava.pom
[INFO] Downloaded from central: https://repo.maven.apache.org/maven2/com/google/guava/listenablefuture/9999.0-empty-to-avoid-conflict-with-guava/listenablefuture-9999.0-empty-to-avoid-conflict-with-guava.pom (2.3 kB at 114 kB/s)
[INFO] Downloading from central: https://repo.maven.apache.org/maven2/com/google/code/findbugs/jsr305/3.0.2/jsr305-3.0.2.pom
[INFO] Downloaded from central: https://repo.maven.apache.org/maven2/com/google/code/findbugs/jsr305/3.0.2/jsr305-3.0.2.pom (4.3 kB at 204 kB/s)
[INFO] Downloading from central: https://repo.maven.apache.org/maven2/org/checkerframework/checker-qual/2.5.2/checker-qual-2.5.2.pom
[INFO] Downloaded from central: https://repo.maven.apache.org/maven2/org/checkerframework/checker-qual/2.5.2/checker-qual-2.5.2.pom (2.5 kB at 86 kB/s)
[INFO] Downloading from central: https://repo.maven.apache.org/maven2/com/google/errorprone/error_prone_annotations/2.2.0/error_prone_annotations-2.2.0.pom
[INFO] Downloaded from central: https://repo.maven.apache.org/maven2/com/google/errorprone/error_prone_annotations/2.2.0/error_prone_annotations-2.2.0.pom (1.8 kB at 81 kB/s)
[INFO] Downloading from central: https://repo.maven.apache.org/maven2/com/google/errorprone/error_prone_parent/2.2.0/error_prone_parent-2.2.0.pom
[INFO] Downloaded from central: https://repo.maven.apache.org/maven2/com/google/errorprone/error_prone_parent/2.2.0/error_prone_parent-2.2.0.pom (5.1 kB at 85 kB/s)
[INFO] Downloading from central: https://repo.maven.apache.org/maven2/com/google/j2objc/j2objc-annotations/1.1/j2objc-annotations-1.1.pom
[INFO] Downloaded from central: https://repo.maven.apache.org/maven2/com/google/j2objc/j2objc-annotations/1.1/j2objc-annotations-1.1.pom (2.8 kB at 48 kB/s)
[INFO] Downloading from central: https://repo.maven.apache.org/maven2/org/codehaus/mojo/animal-sniffer-annotations/1.17/animal-sniffer-annotations-1.17.pom
[INFO] Downloaded from central: https://repo.maven.apache.org/maven2/org/codehaus/mojo/animal-sniffer-annotations/1.17/animal-sniffer-annotations-1.17.pom (2.6 kB at 71 kB/s)
[INFO] Downloading from central: https://repo.maven.apache.org/maven2/org/codehaus/mojo/animal-sniffer-parent/1.17/animal-sniffer-parent-1.17.pom
[INFO] Downloaded from central: https://repo.maven.apache.org/maven2/org/codehaus/mojo/animal-sniffer-parent/1.17/animal-sniffer-parent-1.17.pom (8.6 kB at 410 kB/s)
[INFO] Downloading from central: https://repo.maven.apache.org/maven2/net/sf/saxon/Saxon-HE/9.9.1-1/Saxon-HE-9.9.1-1.pom
[INFO] Downloaded from central: https://repo.maven.apache.org/maven2/net/sf/saxon/Saxon-HE/9.9.1-1/Saxon-HE-9.9.1-1.pom (3.5 kB at 158 kB/s)
[INFO] Downloading from central: https://repo.maven.apache.org/maven2/org/apache/maven/reporting/maven-reporting-impl/2.3/maven-reporting-impl-2.3.pom
[INFO] Downloaded from central: https://repo.maven.apache.org/maven2/org/apache/maven/reporting/maven-reporting-impl/2.3/maven-reporting-impl-2.3.pom (5.0 kB at 217 kB/s)
[INFO] Downloading from central: https://repo.maven.apache.org/maven2/org/apache/maven/shared/maven-shared-components/20/maven-shared-components-20.pom
[INFO] Downloaded from central: https://repo.maven.apache.org/maven2/org/apache/maven/shared/maven-shared-components/20/maven-shared-components-20.pom (5.1 kB at 243 kB/s)
[INFO] Downloading from central: https://repo.maven.apache.org/maven2/org/apache/maven/shared/maven-shared-utils/0.6/maven-shared-utils-0.6.pom
[INFO] Downloaded from central: https://repo.maven.apache.org/maven2/org/apache/maven/shared/maven-shared-utils/0.6/maven-shared-utils-0.6.pom (4.9 kB at 222 kB/s)
[INFO] Downloading from central: https://repo.maven.apache.org/maven2/org/apache/maven/doxia/doxia-sink-api/1.2/doxia-sink-api-1.2.pom
[INFO] Downloaded from central: https://repo.maven.apache.org/maven2/org/apache/maven/doxia/doxia-sink-api/1.2/doxia-sink-api-1.2.pom (1.6 kB at 74 kB/s)
[INFO] Downloading from central: https://repo.maven.apache.org/maven2/org/apache/maven/doxia/doxia/1.2/doxia-1.2.pom
[INFO] Downloaded from central: https://repo.maven.apache.org/maven2/org/apache/maven/doxia/doxia/1.2/doxia-1.2.pom (19 kB at 784 kB/s)
[INFO] Downloading from central: https://repo.maven.apache.org/maven2/org/apache/maven/maven-parent/19/maven-parent-19.pom
[INFO] Downloaded from central: https://repo.maven.apache.org/maven2/org/apache/maven/maven-parent/19/maven-parent-19.pom (25 kB at 1.2 MB/s)
[INFO] Downloading from central: https://repo.maven.apache.org/maven2/org/apache/maven/doxia/doxia-logging-api/1.2/doxia-logging-api-1.2.pom
[INFO] Downloaded from central: https://repo.maven.apache.org/maven2/org/apache/maven/doxia/doxia-logging-api/1.2/doxia-logging-api-1.2.pom (1.6 kB at 75 kB/s)
[INFO] Downloading from central: https://repo.maven.apache.org/maven2/org/apache/maven/doxia/doxia-core/1.2/doxia-core-1.2.pom
[INFO] Downloaded from central: https://repo.maven.apache.org/maven2/org/apache/maven/doxia/doxia-core/1.2/doxia-core-1.2.pom (4.0 kB at 188 kB/s)
[INFO] Downloading from central: https://repo.maven.apache.org/maven2/xerces/xercesImpl/2.9.1/xercesImpl-2.9.1.pom
[INFO] Downloaded from central: https://repo.maven.apache.org/maven2/xerces/xercesImpl/2.9.1/xercesImpl-2.9.1.pom (1.4 kB at 68 kB/s)
[INFO] Downloading from central: https://repo.maven.apache.org/maven2/xml-apis/xml-apis/1.3.04/xml-apis-1.3.04.pom
[INFO] Downloaded from central: https://repo.maven.apache.org/maven2/xml-apis/xml-apis/1.3.04/xml-apis-1.3.04.pom (1.8 kB at 54 kB/s)
[INFO] Downloading from central: https://repo.maven.apache.org/maven2/org/apache/maven/doxia/doxia-site-renderer/1.2/doxia-site-renderer-1.2.pom
[INFO] Downloaded from central: https://repo.maven.apache.org/maven2/org/apache/maven/doxia/doxia-site-renderer/1.2/doxia-site-renderer-1.2.pom (6.2 kB at 297 kB/s)
[INFO] Downloading from central: https://repo.maven.apache.org/maven2/org/apache/maven/doxia/doxia-sitetools/1.2/doxia-sitetools-1.2.pom
[INFO] Downloaded from central: https://repo.maven.apache.org/maven2/org/apache/maven/doxia/doxia-sitetools/1.2/doxia-sitetools-1.2.pom (16 kB at 730 kB/s)
[INFO] Downloading from central: https://repo.maven.apache.org/maven2/org/apache/maven/doxia/doxia-decoration-model/1.2/doxia-decoration-model-1.2.pom
[INFO] Downloaded from central: https://repo.maven.apache.org/maven2/org/apache/maven/doxia/doxia-decoration-model/1.2/doxia-decoration-model-1.2.pom (3.1 kB at 139 kB/s)
[INFO] Downloading from central: https://repo.maven.apache.org/maven2/org/apache/maven/doxia/doxia-module-xhtml/1.2/doxia-module-xhtml-1.2.pom
[INFO] Downloaded from central: https://repo.maven.apache.org/maven2/org/apache/maven/doxia/doxia-module-xhtml/1.2/doxia-module-xhtml-1.2.pom (1.8 kB at 80 kB/s)
[INFO] Downloading from central: https://repo.maven.apache.org/maven2/org/apache/maven/doxia/doxia-modules/1.2/doxia-modules-1.2.pom
[INFO] Downloaded from central: https://repo.maven.apache.org/maven2/org/apache/maven/doxia/doxia-modules/1.2/doxia-modules-1.2.pom (2.5 kB at 119 kB/s)
[INFO] Downloading from central: https://repo.maven.apache.org/maven2/org/apache/maven/doxia/doxia-module-fml/1.2/doxia-module-fml-1.2.pom
[INFO] Downloaded from central: https://repo.maven.apache.org/maven2/org/apache/maven/doxia/doxia-module-fml/1.2/doxia-module-fml-1.2.pom (5.6 kB at 256 kB/s)
[INFO] Downloading from central: https://repo.maven.apache.org/maven2/org/codehaus/plexus/plexus-velocity/1.1.7/plexus-velocity-1.1.7.pom
[INFO] Downloaded from central: https://repo.maven.apache.org/maven2/org/codehaus/plexus/plexus-velocity/1.1.7/plexus-velocity-1.1.7.pom (2.0 kB at 93 kB/s)
[INFO] Downloading from central: https://repo.maven.apache.org/maven2/org/codehaus/plexus/plexus-container-default/1.0-alpha-20/plexus-container-default-1.0-alpha-20.pom
[INFO] Downloaded from central: https://repo.maven.apache.org/maven2/org/codehaus/plexus/plexus-container-default/1.0-alpha-20/plexus-container-default-1.0-alpha-20.pom (3.0 kB at 142 kB/s)
[INFO] Downloading from central: https://repo.maven.apache.org/maven2/org/codehaus/plexus/plexus-containers/1.0-alpha-20/plexus-containers-1.0-alpha-20.pom
[INFO] Downloaded from central: https://repo.maven.apache.org/maven2/org/codehaus/plexus/plexus-containers/1.0-alpha-20/plexus-containers-1.0-alpha-20.pom (1.9 kB at 90 kB/s)
[INFO] Downloading from central: https://repo.maven.apache.org/maven2/org/codehaus/plexus/plexus-utils/1.3/plexus-utils-1.3.pom
[INFO] Downloaded from central: https://repo.maven.apache.org/maven2/org/codehaus/plexus/plexus-utils/1.3/plexus-utils-1.3.pom (1.0 kB at 52 kB/s)
[INFO] Downloading from central: https://repo.maven.apache.org/maven2/org/codehaus/plexus/plexus/1.0.8/plexus-1.0.8.pom
[INFO] Downloaded from central: https://repo.maven.apache.org/maven2/org/codehaus/plexus/plexus/1.0.8/plexus-1.0.8.pom (7.2 kB at 344 kB/s)
[INFO] Downloading from central: https://repo.maven.apache.org/maven2/org/codehaus/plexus/plexus-classworlds/1.2-alpha-7/plexus-classworlds-1.2-alpha-7.pom
[INFO] Downloaded from central: https://repo.maven.apache.org/maven2/org/codehaus/plexus/plexus-classworlds/1.2-alpha-7/plexus-classworlds-1.2-alpha-7.pom (2.4 kB at 119 kB/s)
[INFO] Downloading from central: https://repo.maven.apache.org/maven2/org/codehaus/plexus/plexus/1.0.9/plexus-1.0.9.pom
[INFO] Downloaded from central: https://repo.maven.apache.org/maven2/org/codehaus/plexus/plexus/1.0.9/plexus-1.0.9.pom (7.7 kB at 384 kB/s)
[INFO] Downloading from central: https://repo.maven.apache.org/maven2/org/apache/velocity/velocity/1.5/velocity-1.5.pom
[INFO] Downloaded from central: https://repo.maven.apache.org/maven2/org/apache/velocity/velocity/1.5/velocity-1.5.pom (7.8 kB at 388 kB/s)
[INFO] Downloading from central: https://repo.maven.apache.org/maven2/commons-lang/commons-lang/2.1/commons-lang-2.1.pom
[INFO] Downloaded from central: https://repo.maven.apache.org/maven2/commons-lang/commons-lang/2.1/commons-lang-2.1.pom (9.9 kB at 473 kB/s)
[INFO] Downloading from central: https://repo.maven.apache.org/maven2/org/apache/maven/doxia/doxia-sink-api/1.4/doxia-sink-api-1.4.pom
[INFO] Downloaded from central: https://repo.maven.apache.org/maven2/org/apache/maven/doxia/doxia-sink-api/1.4/doxia-sink-api-1.4.pom (1.5 kB at 77 kB/s)
[INFO] Downloading from central: https://repo.maven.apache.org/maven2/org/apache/maven/doxia/doxia/1.4/doxia-1.4.pom
[INFO] Downloaded from central: https://repo.maven.apache.org/maven2/org/apache/maven/doxia/doxia/1.4/doxia-1.4.pom (18 kB at 855 kB/s)
[INFO] Downloading from central: https://repo.maven.apache.org/maven2/org/apache/maven/doxia/doxia-logging-api/1.4/doxia-logging-api-1.4.pom
[INFO] Downloaded from central: https://repo.maven.apache.org/maven2/org/apache/maven/doxia/doxia-logging-api/1.4/doxia-logging-api-1.4.pom (1.5 kB at 77 kB/s)
[INFO] Downloading from central: https://repo.maven.apache.org/maven2/org/apache/maven/doxia/doxia-decoration-model/1.4/doxia-decoration-model-1.4.pom
[INFO] Downloaded from central: https://repo.maven.apache.org/maven2/org/apache/maven/doxia/doxia-decoration-model/1.4/doxia-decoration-model-1.4.pom (2.7 kB at 127 kB/s)
[INFO] Downloading from central: https://repo.maven.apache.org/maven2/org/apache/maven/doxia/doxia-sitetools/1.4/doxia-sitetools-1.4.pom
[INFO] Downloaded from central: https://repo.maven.apache.org/maven2/org/apache/maven/doxia/doxia-sitetools/1.4/doxia-sitetools-1.4.pom (17 kB at 817 kB/s)
[INFO] Downloading from central: https://repo.maven.apache.org/maven2/org/codehaus/plexus/plexus-utils/3.0.10/plexus-utils-3.0.10.pom
[INFO] Downloaded from central: https://repo.maven.apache.org/maven2/org/codehaus/plexus/plexus-utils/3.0.10/plexus-utils-3.0.10.pom (3.1 kB at 150 kB/s)
[INFO] Downloading from central: https://repo.maven.apache.org/maven2/org/codehaus/plexus/plexus/3.3/plexus-3.3.pom
[INFO] Downloaded from central: https://repo.maven.apache.org/maven2/org/codehaus/plexus/plexus/3.3/plexus-3.3.pom (20 kB at 948 kB/s)
[INFO] Downloading from central: https://repo.maven.apache.org/maven2/org/apache/maven/doxia/doxia-site-renderer/1.4/doxia-site-renderer-1.4.pom
[INFO] Downloaded from central: https://repo.maven.apache.org/maven2/org/apache/maven/doxia/doxia-site-renderer/1.4/doxia-site-renderer-1.4.pom (6.1 kB at 291 kB/s)
[INFO] Downloading from central: https://repo.maven.apache.org/maven2/org/apache/maven/doxia/doxia-core/1.4/doxia-core-1.4.pom
[INFO] Downloaded from central: https://repo.maven.apache.org/maven2/org/apache/maven/doxia/doxia-core/1.4/doxia-core-1.4.pom (4.1 kB at 194 kB/s)
[INFO] Downloading from central: https://repo.maven.apache.org/maven2/org/apache/maven/doxia/doxia-module-xhtml/1.4/doxia-module-xhtml-1.4.pom
[INFO] Downloaded from central: https://repo.maven.apache.org/maven2/org/apache/maven/doxia/doxia-module-xhtml/1.4/doxia-module-xhtml-1.4.pom (1.6 kB at 74 kB/s)
[INFO] Downloading from central: https://repo.maven.apache.org/maven2/org/apache/maven/doxia/doxia-modules/1.4/doxia-modules-1.4.pom
[INFO] Downloaded from central: https://repo.maven.apache.org/maven2/org/apache/maven/doxia/doxia-modules/1.4/doxia-modules-1.4.pom (2.6 kB at 125 kB/s)
[INFO] Downloading from central: https://repo.maven.apache.org/maven2/org/apache/maven/doxia/doxia-module-fml/1.4/doxia-module-fml-1.4.pom
[INFO] Downloaded from central: https://repo.maven.apache.org/maven2/org/apache/maven/doxia/doxia-module-fml/1.4/doxia-module-fml-1.4.pom (4.8 kB at 200 kB/s)
[INFO] Downloading from central: https://repo.maven.apache.org/maven2/org/apache/maven/doxia/doxia-integration-tools/1.6/doxia-integration-tools-1.6.pom
[INFO] Downloaded from central: https://repo.maven.apache.org/maven2/org/apache/maven/doxia/doxia-integration-tools/1.6/doxia-integration-tools-1.6.pom (7.0 kB at 302 kB/s)
[INFO] Downloading from central: https://repo.maven.apache.org/maven2/org/apache/maven/doxia/doxia-tools/3/doxia-tools-3.pom
[INFO] Downloaded from central: https://repo.maven.apache.org/maven2/org/apache/maven/doxia/doxia-tools/3/doxia-tools-3.pom (9.9 kB at 451 kB/s)
[INFO] Downloading from central: https://repo.maven.apache.org/maven2/commons-io/commons-io/1.4/commons-io-1.4.pom
[INFO] Downloaded from central: https://repo.maven.apache.org/maven2/commons-io/commons-io/1.4/commons-io-1.4.pom (13 kB at 572 kB/s)
[INFO] Downloading from central: https://repo.maven.apache.org/maven2/org/apache/commons/commons-parent/7/commons-parent-7.pom
[INFO] Downloaded from central: https://repo.maven.apache.org/maven2/org/apache/commons/commons-parent/7/commons-parent-7.pom (17 kB at 833 kB/s)
[INFO] Downloading from central: https://repo.maven.apache.org/maven2/org/apache/maven/doxia/doxia-logging-api/1.6/doxia-logging-api-1.6.pom
[INFO] Downloaded from central: https://repo.maven.apache.org/maven2/org/apache/maven/doxia/doxia-logging-api/1.6/doxia-logging-api-1.6.pom (1.5 kB at 73 kB/s)
[INFO] Downloading from central: https://repo.maven.apache.org/maven2/org/apache/maven/doxia/doxia/1.6/doxia-1.6.pom
[INFO] Downloaded from central: https://repo.maven.apache.org/maven2/org/apache/maven/doxia/doxia/1.6/doxia-1.6.pom (19 kB at 863 kB/s)
[INFO] Downloading from central: https://repo.maven.apache.org/maven2/org/apache/maven/doxia/doxia-decoration-model/1.6/doxia-decoration-model-1.6.pom
[INFO] Downloaded from central: https://repo.maven.apache.org/maven2/org/apache/maven/doxia/doxia-decoration-model/1.6/doxia-decoration-model-1.6.pom (3.0 kB at 150 kB/s)
[INFO] Downloading from central: https://repo.maven.apache.org/maven2/org/apache/maven/doxia/doxia-sitetools/1.6/doxia-sitetools-1.6.pom
[INFO] Downloaded from central: https://repo.maven.apache.org/maven2/org/apache/maven/doxia/doxia-sitetools/1.6/doxia-sitetools-1.6.pom (18 kB at 542 kB/s)
[INFO] Downloading from central: https://repo.maven.apache.org/maven2/org/codehaus/plexus/plexus-container-default/1.0-alpha-9/plexus-container-default-1.0-alpha-9.pom
[INFO] Downloaded from central: https://repo.maven.apache.org/maven2/org/codehaus/plexus/plexus-container-default/1.0-alpha-9/plexus-container-default-1.0-alpha-9.pom (1.2 kB at 62 kB/s)
[INFO] Downloading from central: https://repo.maven.apache.org/maven2/org/codehaus/plexus/plexus-resources/1.1.0/plexus-resources-1.1.0.pom
[INFO] Downloaded from central: https://repo.maven.apache.org/maven2/org/codehaus/plexus/plexus-resources/1.1.0/plexus-resources-1.1.0.pom (3.2 kB at 151 kB/s)
[INFO] Downloading from central: https://repo.maven.apache.org/maven2/org/codehaus/plexus/plexus-velocity/1.1.8/plexus-velocity-1.1.8.pom
[INFO] Downloaded from central: https://repo.maven.apache.org/maven2/org/codehaus/plexus/plexus-velocity/1.1.8/plexus-velocity-1.1.8.pom (1.9 kB at 96 kB/s)
[INFO] Downloading from central: https://repo.maven.apache.org/maven2/com/puppycrawl/tools/checkstyle/8.18/checkstyle-8.18.jar
[INFO] Downloading from central: https://repo.maven.apache.org/maven2/antlr/antlr/2.7.7/antlr-2.7.7.jar
[INFO] Downloading from central: https://repo.maven.apache.org/maven2/org/antlr/antlr4-runtime/4.7.2/antlr4-runtime-4.7.2.jar
[INFO] Downloading from central: https://repo.maven.apache.org/maven2/commons-beanutils/commons-beanutils/1.9.3/commons-beanutils-1.9.3.jar
[INFO] Downloading from central: https://repo.maven.apache.org/maven2/info/picocli/picocli/3.9.5/picocli-3.9.5.jar
[INFO] Downloaded from central: https://repo.maven.apache.org/maven2/commons-beanutils/commons-beanutils/1.9.3/commons-beanutils-1.9.3.jar (246 kB at 3.7 MB/s)
[INFO] Downloading from central: https://repo.maven.apache.org/maven2/com/google/guava/guava/27.0.1-jre/guava-27.0.1-jre.jar
[INFO] Downloaded from central: https://repo.maven.apache.org/maven2/info/picocli/picocli/3.9.5/picocli-3.9.5.jar (263 kB at 3.2 MB/s)
[INFO] Downloading from central: https://repo.maven.apache.org/maven2/com/google/guava/failureaccess/1.0.1/failureaccess-1.0.1.jar
[INFO] Downloaded from central: https://repo.maven.apache.org/maven2/org/antlr/antlr4-runtime/4.7.2/antlr4-runtime-4.7.2.jar (338 kB at 4.6 MB/s)
[INFO] Downloading from central: https://repo.maven.apache.org/maven2/com/google/guava/listenablefuture/9999.0-empty-to-avoid-conflict-with-guava/listenablefuture-9999.0-empty-to-avoid-conflict-with-guava.jar
[INFO] Downloaded from central: https://repo.maven.apache.org/maven2/antlr/antlr/2.7.7/antlr-2.7.7.jar (445 kB at 5.1 MB/s)
[INFO] Downloading from central: https://repo.maven.apache.org/maven2/com/google/code/findbugs/jsr305/3.0.2/jsr305-3.0.2.jar
[INFO] Downloaded from central: https://repo.maven.apache.org/maven2/com/google/guava/failureaccess/1.0.1/failureaccess-1.0.1.jar (4.6 kB at 52 kB/s)
[INFO] Downloading from central: https://repo.maven.apache.org/maven2/org/checkerframework/checker-qual/2.5.2/checker-qual-2.5.2.jar
[INFO] Downloaded from central: https://repo.maven.apache.org/maven2/com/google/guava/listenablefuture/9999.0-empty-to-avoid-conflict-with-guava/listenablefuture-9999.0-empty-to-avoid-conflict-with-guava.jar (2.2 kB at 24 kB/s)
[INFO] Downloading from central: https://repo.maven.apache.org/maven2/com/google/errorprone/error_prone_annotations/2.2.0/error_prone_annotations-2.2.0.jar
[INFO] Downloaded from central: https://repo.maven.apache.org/maven2/com/google/code/findbugs/jsr305/3.0.2/jsr305-3.0.2.jar (20 kB at 195 kB/s)
[INFO] Downloading from central: https://repo.maven.apache.org/maven2/com/google/j2objc/j2objc-annotations/1.1/j2objc-annotations-1.1.jar
[INFO] Downloaded from central: https://repo.maven.apache.org/maven2/com/google/errorprone/error_prone_annotations/2.2.0/error_prone_annotations-2.2.0.jar (14 kB at 121 kB/s)
[INFO] Downloading from central: https://repo.maven.apache.org/maven2/org/codehaus/mojo/animal-sniffer-annotations/1.17/animal-sniffer-annotations-1.17.jar
[INFO] Downloaded from central: https://repo.maven.apache.org/maven2/com/google/j2objc/j2objc-annotations/1.1/j2objc-annotations-1.1.jar (8.8 kB at 72 kB/s)
[INFO] Downloading from central: https://repo.maven.apache.org/maven2/net/sf/saxon/Saxon-HE/9.9.1-1/Saxon-HE-9.9.1-1.jar
[INFO] Downloaded from central: https://repo.maven.apache.org/maven2/org/checkerframework/checker-qual/2.5.2/checker-qual-2.5.2.jar (193 kB at 1.5 MB/s)
[INFO] Downloading from central: https://repo.maven.apache.org/maven2/org/apache/maven/reporting/maven-reporting-impl/2.3/maven-reporting-impl-2.3.jar
[INFO] Downloaded from central: https://repo.maven.apache.org/maven2/org/codehaus/mojo/animal-sniffer-annotations/1.17/animal-sniffer-annotations-1.17.jar (3.4 kB at 26 kB/s)
[INFO] Downloading from central: https://repo.maven.apache.org/maven2/org/apache/maven/shared/maven-shared-utils/0.6/maven-shared-utils-0.6.jar
[INFO] Downloaded from central: https://repo.maven.apache.org/maven2/com/puppycrawl/tools/checkstyle/8.18/checkstyle-8.18.jar (1.3 MB at 8.1 MB/s)
[INFO] Downloading from central: https://repo.maven.apache.org/maven2/org/apache/maven/doxia/doxia-core/1.2/doxia-core-1.2.jar
[INFO] Downloaded from central: https://repo.maven.apache.org/maven2/org/apache/maven/reporting/maven-reporting-impl/2.3/maven-reporting-impl-2.3.jar (18 kB at 120 kB/s)
[INFO] Downloading from central: https://repo.maven.apache.org/maven2/xerces/xercesImpl/2.9.1/xercesImpl-2.9.1.jar
[INFO] Downloaded from central: https://repo.maven.apache.org/maven2/org/apache/maven/doxia/doxia-core/1.2/doxia-core-1.2.jar (154 kB at 912 kB/s)
[INFO] Downloading from central: https://repo.maven.apache.org/maven2/xml-apis/xml-apis/1.3.04/xml-apis-1.3.04.jar
[INFO] Downloaded from central: https://repo.maven.apache.org/maven2/org/apache/maven/shared/maven-shared-utils/0.6/maven-shared-utils-0.6.jar (165 kB at 952 kB/s)
[INFO] Downloading from central: https://repo.maven.apache.org/maven2/org/apache/httpcomponents/httpclient/4.0.2/httpclient-4.0.2.jar
[INFO] Downloaded from central: https://repo.maven.apache.org/maven2/xml-apis/xml-apis/1.3.04/xml-apis-1.3.04.jar (194 kB at 827 kB/s)
[INFO] Downloading from central: https://repo.maven.apache.org/maven2/commons-digester/commons-digester/1.6/commons-digester-1.6.jar
[INFO] Downloaded from central: https://repo.maven.apache.org/maven2/org/apache/httpcomponents/httpclient/4.0.2/httpclient-4.0.2.jar (293 kB at 1.2 MB/s)
[INFO] Downloading from central: https://repo.maven.apache.org/maven2/org/apache/maven/doxia/doxia-sink-api/1.4/doxia-sink-api-1.4.jar
[INFO] Downloaded from central: https://repo.maven.apache.org/maven2/org/apache/maven/doxia/doxia-sink-api/1.4/doxia-sink-api-1.4.jar (11 kB at 42 kB/s)
[INFO] Downloading from central: https://repo.maven.apache.org/maven2/org/apache/maven/doxia/doxia-logging-api/1.4/doxia-logging-api-1.4.jar
[INFO] Downloaded from central: https://repo.maven.apache.org/maven2/commons-digester/commons-digester/1.6/commons-digester-1.6.jar (168 kB at 571 kB/s)
[INFO] Downloading from central: https://repo.maven.apache.org/maven2/org/apache/maven/doxia/doxia-decoration-model/1.4/doxia-decoration-model-1.4.jar
[INFO] Downloaded from central: https://repo.maven.apache.org/maven2/org/apache/maven/doxia/doxia-logging-api/1.4/doxia-logging-api-1.4.jar (11 kB at 37 kB/s)
[INFO] Downloading from central: https://repo.maven.apache.org/maven2/org/apache/maven/doxia/doxia-site-renderer/1.4/doxia-site-renderer-1.4.jar
[INFO] Downloaded from central: https://repo.maven.apache.org/maven2/xerces/xercesImpl/2.9.1/xercesImpl-2.9.1.jar (1.2 MB at 3.8 MB/s)
[INFO] Downloading from central: https://repo.maven.apache.org/maven2/org/apache/maven/doxia/doxia-module-xhtml/1.4/doxia-module-xhtml-1.4.jar
[INFO] Downloaded from central: https://repo.maven.apache.org/maven2/org/apache/maven/doxia/doxia-site-renderer/1.4/doxia-site-renderer-1.4.jar (53 kB at 162 kB/s)
[INFO] Downloading from central: https://repo.maven.apache.org/maven2/org/apache/maven/doxia/doxia-module-fml/1.4/doxia-module-fml-1.4.jar
[INFO] Downloaded from central: https://repo.maven.apache.org/maven2/org/apache/maven/doxia/doxia-module-xhtml/1.4/doxia-module-xhtml-1.4.jar (15 kB at 44 kB/s)
[INFO] Downloading from central: https://repo.maven.apache.org/maven2/org/apache/maven/doxia/doxia-integration-tools/1.6/doxia-integration-tools-1.6.jar
[INFO] Downloaded from central: https://repo.maven.apache.org/maven2/org/apache/maven/doxia/doxia-module-fml/1.4/doxia-module-fml-1.4.jar (38 kB at 108 kB/s)
[INFO] Downloading from central: https://repo.maven.apache.org/maven2/commons-io/commons-io/1.4/commons-io-1.4.jar
[INFO] Downloaded from central: https://repo.maven.apache.org/maven2/org/apache/maven/doxia/doxia-decoration-model/1.4/doxia-decoration-model-1.4.jar (61 kB at 174 kB/s)
[INFO] Downloading from central: https://repo.maven.apache.org/maven2/org/codehaus/plexus/plexus-container-default/1.0-alpha-9/plexus-container-default-1.0-alpha-9.jar
[INFO] Downloaded from central: https://repo.maven.apache.org/maven2/org/apache/maven/doxia/doxia-integration-tools/1.6/doxia-integration-tools-1.6.jar (45 kB at 120 kB/s)
[INFO] Downloading from central: https://repo.maven.apache.org/maven2/org/codehaus/plexus/plexus-resources/1.1.0/plexus-resources-1.1.0.jar
[INFO] Downloaded from central: https://repo.maven.apache.org/maven2/commons-io/commons-io/1.4/commons-io-1.4.jar (109 kB at 265 kB/s)
[INFO] Downloading from central: https://repo.maven.apache.org/maven2/org/codehaus/plexus/plexus-velocity/1.1.8/plexus-velocity-1.1.8.jar
[INFO] Downloaded from central: https://repo.maven.apache.org/maven2/org/codehaus/plexus/plexus-container-default/1.0-alpha-9/plexus-container-default-1.0-alpha-9.jar (195 kB at 475 kB/s)
[INFO] Downloading from central: https://repo.maven.apache.org/maven2/org/apache/velocity/velocity/1.5/velocity-1.5.jar
[INFO] Downloaded from central: https://repo.maven.apache.org/maven2/org/codehaus/plexus/plexus-resources/1.1.0/plexus-resources-1.1.0.jar (23 kB at 56 kB/s)
[INFO] Downloading from central: https://repo.maven.apache.org/maven2/commons-lang/commons-lang/2.1/commons-lang-2.1.jar
[INFO] Downloaded from central: https://repo.maven.apache.org/maven2/com/google/guava/guava/27.0.1-jre/guava-27.0.1-jre.jar (2.7 MB at 6.6 MB/s)
[INFO] Downloaded from central: https://repo.maven.apache.org/maven2/org/codehaus/plexus/plexus-velocity/1.1.8/plexus-velocity-1.1.8.jar (7.9 kB at 18 kB/s)
[INFO] Downloaded from central: https://repo.maven.apache.org/maven2/commons-lang/commons-lang/2.1/commons-lang-2.1.jar (208 kB at 463 kB/s)
[INFO] Downloaded from central: https://repo.maven.apache.org/maven2/org/apache/velocity/velocity/1.5/velocity-1.5.jar (392 kB at 862 kB/s)
[INFO] Downloaded from central: https://repo.maven.apache.org/maven2/net/sf/saxon/Saxon-HE/9.9.1-1/Saxon-HE-9.9.1-1.jar (5.5 MB at 10 MB/s)
[INFO] 
[INFO] --- license-maven-plugin:1.16:check-file-header (license-check) @ soot ---
[INFO] Downloading from central: https://repo.maven.apache.org/maven2/org/apache/maven/reporting/maven-reporting-impl/3.0.0/maven-reporting-impl-3.0.0.pom
[INFO] Downloaded from central: https://repo.maven.apache.org/maven2/org/apache/maven/reporting/maven-reporting-impl/3.0.0/maven-reporting-impl-3.0.0.pom (7.6 kB at 331 kB/s)
[INFO] Downloading from central: https://repo.maven.apache.org/maven2/org/apache/httpcomponents/httpclient/4.5.4/httpclient-4.5.4.pom
[INFO] Downloaded from central: https://repo.maven.apache.org/maven2/org/apache/httpcomponents/httpclient/4.5.4/httpclient-4.5.4.pom (6.2 kB at 271 kB/s)
[INFO] Downloading from central: https://repo.maven.apache.org/maven2/org/apache/httpcomponents/httpcomponents-client/4.5.4/httpcomponents-client-4.5.4.pom
[INFO] Downloaded from central: https://repo.maven.apache.org/maven2/org/apache/httpcomponents/httpcomponents-client/4.5.4/httpcomponents-client-4.5.4.pom (15 kB at 378 kB/s)
[INFO] Downloading from central: https://repo.maven.apache.org/maven2/org/apache/httpcomponents/httpcomponents-parent/10/httpcomponents-parent-10.pom
[INFO] Downloaded from central: https://repo.maven.apache.org/maven2/org/apache/httpcomponents/httpcomponents-parent/10/httpcomponents-parent-10.pom (34 kB at 570 kB/s)
[INFO] Downloading from central: https://repo.maven.apache.org/maven2/org/apache/httpcomponents/httpcore/4.4.8/httpcore-4.4.8.pom
[INFO] Downloaded from central: https://repo.maven.apache.org/maven2/org/apache/httpcomponents/httpcore/4.4.8/httpcore-4.4.8.pom (5.1 kB at 92 kB/s)
[INFO] Downloading from central: https://repo.maven.apache.org/maven2/org/apache/httpcomponents/httpcomponents-core/4.4.8/httpcomponents-core-4.4.8.pom
[INFO] Downloaded from central: https://repo.maven.apache.org/maven2/org/apache/httpcomponents/httpcomponents-core/4.4.8/httpcomponents-core-4.4.8.pom (13 kB at 642 kB/s)
[INFO] Downloading from central: https://repo.maven.apache.org/maven2/org/apache/httpcomponents/httpcomponents-parent/9/httpcomponents-parent-9.pom
[INFO] Downloaded from central: https://repo.maven.apache.org/maven2/org/apache/httpcomponents/httpcomponents-parent/9/httpcomponents-parent-9.pom (34 kB at 1.6 MB/s)
[INFO] Downloading from central: https://repo.maven.apache.org/maven2/commons-codec/commons-codec/1.10/commons-codec-1.10.pom
[INFO] Downloaded from central: https://repo.maven.apache.org/maven2/commons-codec/commons-codec/1.10/commons-codec-1.10.pom (12 kB at 505 kB/s)
[INFO] Downloading from central: https://repo.maven.apache.org/maven2/org/apache/commons/commons-parent/35/commons-parent-35.pom
[INFO] Downloaded from central: https://repo.maven.apache.org/maven2/org/apache/commons/commons-parent/35/commons-parent-35.pom (58 kB at 2.5 MB/s)
[INFO] Downloading from central: https://repo.maven.apache.org/maven2/org/apache/maven/doxia/doxia-core/1.5/doxia-core-1.5.pom
[INFO] Downloaded from central: https://repo.maven.apache.org/maven2/org/apache/maven/doxia/doxia-core/1.5/doxia-core-1.5.pom (4.1 kB at 194 kB/s)
[INFO] Downloading from central: https://repo.maven.apache.org/maven2/org/apache/maven/doxia/doxia/1.5/doxia-1.5.pom
[INFO] Downloaded from central: https://repo.maven.apache.org/maven2/org/apache/maven/doxia/doxia/1.5/doxia-1.5.pom (18 kB at 829 kB/s)
[INFO] Downloading from central: https://repo.maven.apache.org/maven2/org/apache/maven/doxia/doxia-sink-api/1.5/doxia-sink-api-1.5.pom
[INFO] Downloaded from central: https://repo.maven.apache.org/maven2/org/apache/maven/doxia/doxia-sink-api/1.5/doxia-sink-api-1.5.pom (1.5 kB at 73 kB/s)
[INFO] Downloading from central: https://repo.maven.apache.org/maven2/org/apache/maven/doxia/doxia-logging-api/1.5/doxia-logging-api-1.5.pom
[INFO] Downloaded from central: https://repo.maven.apache.org/maven2/org/apache/maven/doxia/doxia-logging-api/1.5/doxia-logging-api-1.5.pom (1.5 kB at 73 kB/s)
[INFO] Downloading from central: https://repo.maven.apache.org/maven2/org/codehaus/plexus/plexus-component-annotations/1.7.1/plexus-component-annotations-1.7.1.pom
[INFO] Downloaded from central: https://repo.maven.apache.org/maven2/org/codehaus/plexus/plexus-component-annotations/1.7.1/plexus-component-annotations-1.7.1.pom (770 B at 38 kB/s)
[INFO] Downloading from central: https://repo.maven.apache.org/maven2/org/codehaus/plexus/plexus-containers/1.7.1/plexus-containers-1.7.1.pom
[INFO] Downloaded from central: https://repo.maven.apache.org/maven2/org/codehaus/plexus/plexus-containers/1.7.1/plexus-containers-1.7.1.pom (5.0 kB at 240 kB/s)
[INFO] Downloading from central: https://repo.maven.apache.org/maven2/org/nuiton/processor/nuiton-processor/1.3/nuiton-processor-1.3.pom
[INFO] Downloaded from central: https://repo.maven.apache.org/maven2/org/nuiton/processor/nuiton-processor/1.3/nuiton-processor-1.3.pom (4.5 kB at 204 kB/s)
[INFO] Downloading from central: https://repo.maven.apache.org/maven2/org/nuiton/processor/1.3/processor-1.3.pom
[INFO] Downloaded from central: https://repo.maven.apache.org/maven2/org/nuiton/processor/1.3/processor-1.3.pom (7.0 kB at 332 kB/s)
[INFO] Downloading from central: https://repo.maven.apache.org/maven2/org/nuiton/mavenpom4redmineAndCentral/3.4.4/mavenpom4redmineAndCentral-3.4.4.pom
[INFO] Downloaded from central: https://repo.maven.apache.org/maven2/org/nuiton/mavenpom4redmineAndCentral/3.4.4/mavenpom4redmineAndCentral-3.4.4.pom (4.5 kB at 204 kB/s)
[INFO] Downloading from central: https://repo.maven.apache.org/maven2/org/nuiton/mavenpom4redmine/3.4.4/mavenpom4redmine-3.4.4.pom
[INFO] Downloaded from central: https://repo.maven.apache.org/maven2/org/nuiton/mavenpom4redmine/3.4.4/mavenpom4redmine-3.4.4.pom (21 kB at 920 kB/s)
[INFO] Downloading from central: https://repo.maven.apache.org/maven2/org/nuiton/mavenpom/3.4.4/mavenpom-3.4.4.pom
[INFO] Downloaded from central: https://repo.maven.apache.org/maven2/org/nuiton/mavenpom/3.4.4/mavenpom-3.4.4.pom (67 kB at 2.8 MB/s)
[INFO] Downloading from central: https://repo.maven.apache.org/maven2/org/apache/commons/commons-lang3/3.7/commons-lang3-3.7.pom
[INFO] Downloaded from central: https://repo.maven.apache.org/maven2/org/apache/commons/commons-lang3/3.7/commons-lang3-3.7.pom (28 kB at 1.3 MB/s)
[INFO] Downloading from central: https://repo.maven.apache.org/maven2/org/freemarker/freemarker/2.3.20/freemarker-2.3.20.pom
[INFO] Downloaded from central: https://repo.maven.apache.org/maven2/org/freemarker/freemarker/2.3.20/freemarker-2.3.20.pom (1.5 kB at 72 kB/s)
[INFO] Downloading from central: https://repo.maven.apache.org/maven2/log4j/log4j/1.2.17/log4j-1.2.17.pom
[INFO] Downloaded from central: https://repo.maven.apache.org/maven2/log4j/log4j/1.2.17/log4j-1.2.17.pom (22 kB at 988 kB/s)
[INFO] Downloading from central: https://repo.maven.apache.org/maven2/org/apache/maven/reporting/maven-reporting-impl/3.0.0/maven-reporting-impl-3.0.0.jar
[INFO] Downloading from central: https://repo.maven.apache.org/maven2/org/apache/maven/shared/maven-shared-utils/3.2.0/maven-shared-utils-3.2.0.jar
[INFO] Downloading from central: https://repo.maven.apache.org/maven2/org/apache/maven/doxia/doxia-core/1.5/doxia-core-1.5.jar
[INFO] Downloading from central: https://repo.maven.apache.org/maven2/org/apache/maven/doxia/doxia-logging-api/1.5/doxia-logging-api-1.5.jar
[INFO] Downloading from central: https://repo.maven.apache.org/maven2/org/apache/httpcomponents/httpclient/4.5.4/httpclient-4.5.4.jar
[INFO] Downloaded from central: https://repo.maven.apache.org/maven2/org/apache/maven/reporting/maven-reporting-impl/3.0.0/maven-reporting-impl-3.0.0.jar (18 kB at 634 kB/s)
[INFO] Downloading from central: https://repo.maven.apache.org/maven2/commons-codec/commons-codec/1.10/commons-codec-1.10.jar
[INFO] Downloaded from central: https://repo.maven.apache.org/maven2/org/apache/maven/shared/maven-shared-utils/3.2.0/maven-shared-utils-3.2.0.jar (165 kB at 4.4 MB/s)
[INFO] Downloading from central: https://repo.maven.apache.org/maven2/org/apache/httpcomponents/httpcore/4.4.8/httpcore-4.4.8.jar
[INFO] Downloaded from central: https://repo.maven.apache.org/maven2/org/apache/maven/doxia/doxia-core/1.5/doxia-core-1.5.jar (163 kB at 3.6 MB/s)
[INFO] Downloading from central: https://repo.maven.apache.org/maven2/org/apache/maven/doxia/doxia-sink-api/1.5/doxia-sink-api-1.5.jar
[INFO] Downloaded from central: https://repo.maven.apache.org/maven2/org/apache/maven/doxia/doxia-logging-api/1.5/doxia-logging-api-1.5.jar (11 kB at 246 kB/s)
[INFO] Downloading from central: https://repo.maven.apache.org/maven2/org/codehaus/plexus/plexus-velocity/1.1.7/plexus-velocity-1.1.7.jar
[INFO] Downloaded from central: https://repo.maven.apache.org/maven2/org/apache/maven/doxia/doxia-sink-api/1.5/doxia-sink-api-1.5.jar (11 kB at 193 kB/s)
[INFO] Downloaded from central: https://repo.maven.apache.org/maven2/org/codehaus/plexus/plexus-velocity/1.1.7/plexus-velocity-1.1.7.jar (7.7 kB at 130 kB/s)
[INFO] Downloading from central: https://repo.maven.apache.org/maven2/org/codehaus/plexus/plexus-component-annotations/1.7.1/plexus-component-annotations-1.7.1.jar
[INFO] Downloading from central: https://repo.maven.apache.org/maven2/org/nuiton/processor/nuiton-processor/1.3/nuiton-processor-1.3.jar
[INFO] Downloaded from central: https://repo.maven.apache.org/maven2/commons-codec/commons-codec/1.10/commons-codec-1.10.jar (284 kB at 4.4 MB/s)
[INFO] Downloading from central: https://repo.maven.apache.org/maven2/org/apache/commons/commons-lang3/3.7/commons-lang3-3.7.jar
[INFO] Downloaded from central: https://repo.maven.apache.org/maven2/org/apache/httpcomponents/httpclient/4.5.4/httpclient-4.5.4.jar (782 kB at 11 MB/s)
[INFO] Downloading from central: https://repo.maven.apache.org/maven2/org/freemarker/freemarker/2.3.20/freemarker-2.3.20.jar
[INFO] Downloaded from central: https://repo.maven.apache.org/maven2/org/apache/httpcomponents/httpcore/4.4.8/httpcore-4.4.8.jar (325 kB at 4.8 MB/s)
[INFO] Downloading from central: https://repo.maven.apache.org/maven2/log4j/log4j/1.2.17/log4j-1.2.17.jar
[INFO] Downloaded from central: https://repo.maven.apache.org/maven2/org/nuiton/processor/nuiton-processor/1.3/nuiton-processor-1.3.jar (30 kB at 360 kB/s)
[INFO] Downloaded from central: https://repo.maven.apache.org/maven2/org/codehaus/plexus/plexus-component-annotations/1.7.1/plexus-component-annotations-1.7.1.jar (4.3 kB at 52 kB/s)
[INFO] Downloaded from central: https://repo.maven.apache.org/maven2/log4j/log4j/1.2.17/log4j-1.2.17.jar (490 kB at 3.6 MB/s)
[INFO] Downloaded from central: https://repo.maven.apache.org/maven2/org/apache/commons/commons-lang3/3.7/commons-lang3-3.7.jar (500 kB at 3.6 MB/s)
[INFO] Downloaded from central: https://repo.maven.apache.org/maven2/org/freemarker/freemarker/2.3.20/freemarker-2.3.20.jar (1.0 MB at 6.5 MB/s)
[INFO] Will search files to update from root /data/jenkins/workspace/soot/soot-master/src/main/java
[INFO] Will search files to update from root /data/jenkins/workspace/soot/soot-master/src/test/java
[INFO] Will search files to update from root /data/jenkins/workspace/soot/soot-master/src/it
[INFO] Will search files to update from root /data/jenkins/workspace/soot/soot-master/src/systemTest/java
[INFO] Will search files to update from root /data/jenkins/workspace/soot/soot-master/src/systemTest/targets
[INFO] Scan 2714 files header done in 4.533s.
[INFO] All files are up-to-date.
[INFO] 
[INFO] --- maven-gpg-plugin:1.6:sign (sign-artifacts) @ soot ---
[INFO] Downloading from central: https://repo.maven.apache.org/maven2/org/codehaus/plexus/plexus-utils/3.0.20/plexus-utils-3.0.20.jar
[INFO] Downloaded from central: https://repo.maven.apache.org/maven2/org/codehaus/plexus/plexus-utils/3.0.20/plexus-utils-3.0.20.jar (243 kB at 5.5 MB/s)
[INFO] 
[INFO] --- maven-install-plugin:2.4:install (default-install) @ soot ---
[INFO] Downloading from central: https://repo.maven.apache.org/maven2/org/apache/maven/maven-plugin-api/2.0.6/maven-plugin-api-2.0.6.pom
[INFO] Downloaded from central: https://repo.maven.apache.org/maven2/org/apache/maven/maven-plugin-api/2.0.6/maven-plugin-api-2.0.6.pom (1.5 kB at 42 kB/s)
[INFO] Downloading from central: https://repo.maven.apache.org/maven2/org/apache/maven/maven-project/2.0.6/maven-project-2.0.6.pom
[INFO] Downloaded from central: https://repo.maven.apache.org/maven2/org/apache/maven/maven-project/2.0.6/maven-project-2.0.6.pom (2.6 kB at 132 kB/s)
[INFO] Downloading from central: https://repo.maven.apache.org/maven2/org/apache/maven/maven-settings/2.0.6/maven-settings-2.0.6.pom
[INFO] Downloaded from central: https://repo.maven.apache.org/maven2/org/apache/maven/maven-settings/2.0.6/maven-settings-2.0.6.pom (2.0 kB at 95 kB/s)
[INFO] Downloading from central: https://repo.maven.apache.org/maven2/org/apache/maven/maven-profile/2.0.6/maven-profile-2.0.6.pom
[INFO] Downloaded from central: https://repo.maven.apache.org/maven2/org/apache/maven/maven-profile/2.0.6/maven-profile-2.0.6.pom (2.0 kB at 99 kB/s)
[INFO] Downloading from central: https://repo.maven.apache.org/maven2/org/apache/maven/maven-artifact-manager/2.0.6/maven-artifact-manager-2.0.6.pom
[INFO] Downloaded from central: https://repo.maven.apache.org/maven2/org/apache/maven/maven-artifact-manager/2.0.6/maven-artifact-manager-2.0.6.pom (2.6 kB at 125 kB/s)
[INFO] Downloading from central: https://repo.maven.apache.org/maven2/org/apache/maven/maven-repository-metadata/2.0.6/maven-repository-metadata-2.0.6.pom
[INFO] Downloaded from central: https://repo.maven.apache.org/maven2/org/apache/maven/maven-repository-metadata/2.0.6/maven-repository-metadata-2.0.6.pom (1.9 kB at 92 kB/s)
[INFO] Downloading from central: https://repo.maven.apache.org/maven2/org/apache/maven/maven-plugin-registry/2.0.6/maven-plugin-registry-2.0.6.pom
[INFO] Downloaded from central: https://repo.maven.apache.org/maven2/org/apache/maven/maven-plugin-registry/2.0.6/maven-plugin-registry-2.0.6.pom (1.9 kB at 93 kB/s)
[INFO] Downloading from central: https://repo.maven.apache.org/maven2/org/codehaus/plexus/plexus-utils/3.0.5/plexus-utils-3.0.5.pom
[INFO] Downloaded from central: https://repo.maven.apache.org/maven2/org/codehaus/plexus/plexus-utils/3.0.5/plexus-utils-3.0.5.pom (2.5 kB at 126 kB/s)
[INFO] Downloading from central: https://repo.maven.apache.org/maven2/org/codehaus/plexus/plexus/3.1/plexus-3.1.pom
[INFO] Downloaded from central: https://repo.maven.apache.org/maven2/org/codehaus/plexus/plexus/3.1/plexus-3.1.pom (19 kB at 886 kB/s)
[INFO] Downloading from central: https://repo.maven.apache.org/maven2/org/codehaus/plexus/plexus-digest/1.0/plexus-digest-1.0.pom
[INFO] Downloaded from central: https://repo.maven.apache.org/maven2/org/codehaus/plexus/plexus-digest/1.0/plexus-digest-1.0.pom (1.1 kB at 53 kB/s)
[INFO] Downloading from central: https://repo.maven.apache.org/maven2/org/codehaus/plexus/plexus-components/1.1.7/plexus-components-1.1.7.pom
[INFO] Downloaded from central: https://repo.maven.apache.org/maven2/org/codehaus/plexus/plexus-components/1.1.7/plexus-components-1.1.7.pom (5.0 kB at 237 kB/s)
[INFO] Downloading from central: https://repo.maven.apache.org/maven2/org/codehaus/plexus/plexus-container-default/1.0-alpha-8/plexus-container-default-1.0-alpha-8.pom
[INFO] Downloaded from central: https://repo.maven.apache.org/maven2/org/codehaus/plexus/plexus-container-default/1.0-alpha-8/plexus-container-default-1.0-alpha-8.pom (7.3 kB at 330 kB/s)
[INFO] Downloading from central: https://repo.maven.apache.org/maven2/org/apache/maven/maven-plugin-api/2.0.6/maven-plugin-api-2.0.6.jar
[INFO] Downloading from central: https://repo.maven.apache.org/maven2/org/apache/maven/maven-project/2.0.6/maven-project-2.0.6.jar
[INFO] Downloading from central: https://repo.maven.apache.org/maven2/org/apache/maven/maven-settings/2.0.6/maven-settings-2.0.6.jar
[INFO] Downloading from central: https://repo.maven.apache.org/maven2/org/apache/maven/maven-profile/2.0.6/maven-profile-2.0.6.jar
[INFO] Downloading from central: https://repo.maven.apache.org/maven2/org/apache/maven/maven-plugin-registry/2.0.6/maven-plugin-registry-2.0.6.jar
[INFO] Downloaded from central: https://repo.maven.apache.org/maven2/org/apache/maven/maven-plugin-api/2.0.6/maven-plugin-api-2.0.6.jar (13 kB at 402 kB/s)
[INFO] Downloading from central: https://repo.maven.apache.org/maven2/org/apache/maven/maven-model/2.0.6/maven-model-2.0.6.jar
[INFO] Downloaded from central: https://repo.maven.apache.org/maven2/org/apache/maven/maven-project/2.0.6/maven-project-2.0.6.jar (116 kB at 3.9 MB/s)
[INFO] Downloading from central: https://repo.maven.apache.org/maven2/org/apache/maven/maven-artifact-manager/2.0.6/maven-artifact-manager-2.0.6.jar
[INFO] Downloaded from central: https://repo.maven.apache.org/maven2/org/apache/maven/maven-profile/2.0.6/maven-profile-2.0.6.jar (35 kB at 979 kB/s)
[INFO] Downloading from central: https://repo.maven.apache.org/maven2/org/apache/maven/maven-repository-metadata/2.0.6/maven-repository-metadata-2.0.6.jar
[INFO] Downloaded from central: https://repo.maven.apache.org/maven2/org/apache/maven/maven-settings/2.0.6/maven-settings-2.0.6.jar (49 kB at 1.3 MB/s)
[INFO] Downloading from central: https://repo.maven.apache.org/maven2/org/apache/maven/maven-artifact/2.0.6/maven-artifact-2.0.6.jar
[INFO] Downloaded from central: https://repo.maven.apache.org/maven2/org/apache/maven/maven-plugin-registry/2.0.6/maven-plugin-registry-2.0.6.jar (29 kB at 673 kB/s)
[INFO] Downloading from central: https://repo.maven.apache.org/maven2/org/codehaus/plexus/plexus-utils/3.0.5/plexus-utils-3.0.5.jar
[INFO] Downloaded from central: https://repo.maven.apache.org/maven2/org/apache/maven/maven-model/2.0.6/maven-model-2.0.6.jar (86 kB at 1.9 MB/s)
[INFO] Downloading from central: https://repo.maven.apache.org/maven2/org/codehaus/plexus/plexus-digest/1.0/plexus-digest-1.0.jar
[INFO] Downloaded from central: https://repo.maven.apache.org/maven2/org/apache/maven/maven-repository-metadata/2.0.6/maven-repository-metadata-2.0.6.jar (24 kB at 429 kB/s)
[INFO] Downloaded from central: https://repo.maven.apache.org/maven2/org/apache/maven/maven-artifact/2.0.6/maven-artifact-2.0.6.jar (87 kB at 1.3 MB/s)
[INFO] Downloaded from central: https://repo.maven.apache.org/maven2/org/apache/maven/maven-artifact-manager/2.0.6/maven-artifact-manager-2.0.6.jar (57 kB at 796 kB/s)
[INFO] Downloaded from central: https://repo.maven.apache.org/maven2/org/codehaus/plexus/plexus-digest/1.0/plexus-digest-1.0.jar (12 kB at 158 kB/s)
[INFO] Downloaded from central: https://repo.maven.apache.org/maven2/org/codehaus/plexus/plexus-utils/3.0.5/plexus-utils-3.0.5.jar (230 kB at 3.0 MB/s)
[INFO] Installing /data/jenkins/workspace/soot/soot-master/target/sootclasses-trunk.jar to /data/jenkins/workspace/soot/soot-master/.repository/ca/mcgill/sable/soot/3.3.0/soot-3.3.0.jar
[INFO] Installing /data/jenkins/workspace/soot/soot-master/pom.xml to /data/jenkins/workspace/soot/soot-master/.repository/ca/mcgill/sable/soot/3.3.0/soot-3.3.0.pom
[INFO] Installing /data/jenkins/workspace/soot/soot-master/target/sootclasses-trunk-jar-with-dependencies.jar to /data/jenkins/workspace/soot/soot-master/.repository/ca/mcgill/sable/soot/3.3.0/soot-3.3.0-jar-with-dependencies.jar
[INFO] Installing /data/jenkins/workspace/soot/soot-master/target/sootclasses-trunk-sources.jar to /data/jenkins/workspace/soot/soot-master/.repository/ca/mcgill/sable/soot/3.3.0/soot-3.3.0-sources.jar
[INFO] Installing /data/jenkins/workspace/soot/soot-master/target/sootclasses-trunk-javadoc.jar to /data/jenkins/workspace/soot/soot-master/.repository/ca/mcgill/sable/soot/3.3.0/soot-3.3.0-javadoc.jar
[INFO] Installing /data/jenkins/workspace/soot/soot-master/target/sootclasses-trunk.jar.asc to /data/jenkins/workspace/soot/soot-master/.repository/ca/mcgill/sable/soot/3.3.0/soot-3.3.0.jar.asc
[INFO] Installing /data/jenkins/workspace/soot/soot-master/target/sootclasses-trunk.pom.asc to /data/jenkins/workspace/soot/soot-master/.repository/ca/mcgill/sable/soot/3.3.0/soot-3.3.0.pom.asc
[INFO] Installing /data/jenkins/workspace/soot/soot-master/target/sootclasses-trunk-jar-with-dependencies.jar.asc to /data/jenkins/workspace/soot/soot-master/.repository/ca/mcgill/sable/soot/3.3.0/soot-3.3.0-jar-with-dependencies.jar.asc
[INFO] Installing /data/jenkins/workspace/soot/soot-master/target/sootclasses-trunk-sources.jar.asc to /data/jenkins/workspace/soot/soot-master/.repository/ca/mcgill/sable/soot/3.3.0/soot-3.3.0-sources.jar.asc
[INFO] Installing /data/jenkins/workspace/soot/soot-master/target/sootclasses-trunk-javadoc.jar.asc to /data/jenkins/workspace/soot/soot-master/.repository/ca/mcgill/sable/soot/3.3.0/soot-3.3.0-javadoc.jar.asc
[INFO] 
[INFO] --- nexus-staging-maven-plugin:1.6.8:deploy (injected-nexus-deploy) @ soot ---
[INFO] Performing local staging (local stagingDirectory="/data/jenkins/workspace/soot/soot-master/target/nexus-staging/staging")...
[INFO]  + Using server credentials "ossrh" from Maven settings.
[INFO]  * Connected to Nexus at https://oss.sonatype.org:443/, is version 2.14.14-01 and edition "Professional"
[INFO]  * Using staging profile ID "919a77e2315dcb" (matched by Nexus).
[INFO] Installing /data/jenkins/workspace/soot/soot-master/target/sootclasses-trunk.jar to /data2/jenkins/workspace/soot/soot-master/target/nexus-staging/staging/919a77e2315dcb/ca/mcgill/sable/soot/3.3.0/soot-3.3.0.jar
[INFO] Installing /data/jenkins/workspace/soot/soot-master/pom.xml to /data2/jenkins/workspace/soot/soot-master/target/nexus-staging/staging/919a77e2315dcb/ca/mcgill/sable/soot/3.3.0/soot-3.3.0.pom
[INFO] Installing /data/jenkins/workspace/soot/soot-master/target/sootclasses-trunk-jar-with-dependencies.jar to /data2/jenkins/workspace/soot/soot-master/target/nexus-staging/staging/919a77e2315dcb/ca/mcgill/sable/soot/3.3.0/soot-3.3.0-jar-with-dependencies.jar
[INFO] Installing /data/jenkins/workspace/soot/soot-master/target/sootclasses-trunk-sources.jar to /data2/jenkins/workspace/soot/soot-master/target/nexus-staging/staging/919a77e2315dcb/ca/mcgill/sable/soot/3.3.0/soot-3.3.0-sources.jar
[INFO] Installing /data/jenkins/workspace/soot/soot-master/target/sootclasses-trunk-javadoc.jar to /data2/jenkins/workspace/soot/soot-master/target/nexus-staging/staging/919a77e2315dcb/ca/mcgill/sable/soot/3.3.0/soot-3.3.0-javadoc.jar
[INFO] Installing /data/jenkins/workspace/soot/soot-master/target/sootclasses-trunk.jar.asc to /data2/jenkins/workspace/soot/soot-master/target/nexus-staging/staging/919a77e2315dcb/ca/mcgill/sable/soot/3.3.0/soot-3.3.0.jar.asc
[INFO] Installing /data/jenkins/workspace/soot/soot-master/target/sootclasses-trunk.pom.asc to /data2/jenkins/workspace/soot/soot-master/target/nexus-staging/staging/919a77e2315dcb/ca/mcgill/sable/soot/3.3.0/soot-3.3.0.pom.asc
[INFO] Installing /data/jenkins/workspace/soot/soot-master/target/sootclasses-trunk-jar-with-dependencies.jar.asc to /data2/jenkins/workspace/soot/soot-master/target/nexus-staging/staging/919a77e2315dcb/ca/mcgill/sable/soot/3.3.0/soot-3.3.0-jar-with-dependencies.jar.asc
[INFO] Installing /data/jenkins/workspace/soot/soot-master/target/sootclasses-trunk-sources.jar.asc to /data2/jenkins/workspace/soot/soot-master/target/nexus-staging/staging/919a77e2315dcb/ca/mcgill/sable/soot/3.3.0/soot-3.3.0-sources.jar.asc
[INFO] Installing /data/jenkins/workspace/soot/soot-master/target/sootclasses-trunk-javadoc.jar.asc to /data2/jenkins/workspace/soot/soot-master/target/nexus-staging/staging/919a77e2315dcb/ca/mcgill/sable/soot/3.3.0/soot-3.3.0-javadoc.jar.asc
[INFO] Performing remote staging...
[INFO] 
[INFO]  * Remote staging into staging profile ID "919a77e2315dcb"
[INFO]  * Created staging repository with ID "camcgill-1029".
[INFO]  * Staging repository at https://oss.sonatype.org:443/service/local/staging/deployByRepositoryId/camcgill-1029
[INFO]  * Uploading locally staged artifacts to profile ca.mcgill
[INFO] Uploading to ossrh: https://oss.sonatype.org:443/service/local/staging/deployByRepositoryId/camcgill-1029/ca/mcgill/sable/soot/3.3.0/soot-3.3.0.jar.asc
[INFO] Uploaded to ossrh: https://oss.sonatype.org:443/service/local/staging/deployByRepositoryId/camcgill-1029/ca/mcgill/sable/soot/3.3.0/soot-3.3.0.jar.asc (488 B at 862 B/s)
[INFO] Downloading from ossrh: https://oss.sonatype.org:443/service/local/staging/deployByRepositoryId/camcgill-1029/ca/mcgill/sable/soot/maven-metadata.xml
[INFO] Uploading to ossrh: https://oss.sonatype.org:443/service/local/staging/deployByRepositoryId/camcgill-1029/ca/mcgill/sable/soot/maven-metadata.xml
[INFO] Uploaded to ossrh: https://oss.sonatype.org:443/service/local/staging/deployByRepositoryId/camcgill-1029/ca/mcgill/sable/soot/maven-metadata.xml (299 B at 330 B/s)
[INFO] Uploading to ossrh: https://oss.sonatype.org:443/service/local/staging/deployByRepositoryId/camcgill-1029/ca/mcgill/sable/soot/3.3.0/soot-3.3.0-javadoc.jar.asc
[INFO] Uploaded to ossrh: https://oss.sonatype.org:443/service/local/staging/deployByRepositoryId/camcgill-1029/ca/mcgill/sable/soot/3.3.0/soot-3.3.0-javadoc.jar.asc (488 B at 2.1 kB/s)
[INFO] Uploading to ossrh: https://oss.sonatype.org:443/service/local/staging/deployByRepositoryId/camcgill-1029/ca/mcgill/sable/soot/3.3.0/soot-3.3.0-sources.jar.asc
[INFO] Uploaded to ossrh: https://oss.sonatype.org:443/service/local/staging/deployByRepositoryId/camcgill-1029/ca/mcgill/sable/soot/3.3.0/soot-3.3.0-sources.jar.asc (488 B at 2.1 kB/s)
[INFO] Uploading to ossrh: https://oss.sonatype.org:443/service/local/staging/deployByRepositoryId/camcgill-1029/ca/mcgill/sable/soot/3.3.0/soot-3.3.0.jar
[INFO] Uploaded to ossrh: https://oss.sonatype.org:443/service/local/staging/deployByRepositoryId/camcgill-1029/ca/mcgill/sable/soot/3.3.0/soot-3.3.0.jar (6.3 MB at 2.2 MB/s)
[INFO] Uploading to ossrh: https://oss.sonatype.org:443/service/local/staging/deployByRepositoryId/camcgill-1029/ca/mcgill/sable/soot/3.3.0/soot-3.3.0.pom
[INFO] Uploaded to ossrh: https://oss.sonatype.org:443/service/local/staging/deployByRepositoryId/camcgill-1029/ca/mcgill/sable/soot/3.3.0/soot-3.3.0.pom (27 kB at 33 kB/s)
[INFO] Uploading to ossrh: https://oss.sonatype.org:443/service/local/staging/deployByRepositoryId/camcgill-1029/ca/mcgill/sable/soot/3.3.0/soot-3.3.0-jar-with-dependencies.jar.asc
[INFO] Uploaded to ossrh: https://oss.sonatype.org:443/service/local/staging/deployByRepositoryId/camcgill-1029/ca/mcgill/sable/soot/3.3.0/soot-3.3.0-jar-with-dependencies.jar.asc (488 B at 2.1 kB/s)
[INFO] Uploading to ossrh: https://oss.sonatype.org:443/service/local/staging/deployByRepositoryId/camcgill-1029/ca/mcgill/sable/soot/3.3.0/soot-3.3.0-javadoc.jar
[INFO] Uploaded to ossrh: https://oss.sonatype.org:443/service/local/staging/deployByRepositoryId/camcgill-1029/ca/mcgill/sable/soot/3.3.0/soot-3.3.0-javadoc.jar (18 MB at 6.2 MB/s)
[INFO] Uploading to ossrh: https://oss.sonatype.org:443/service/local/staging/deployByRepositoryId/camcgill-1029/ca/mcgill/sable/soot/3.3.0/soot-3.3.0.pom.asc
[INFO] Uploaded to ossrh: https://oss.sonatype.org:443/service/local/staging/deployByRepositoryId/camcgill-1029/ca/mcgill/sable/soot/3.3.0/soot-3.3.0.pom.asc (488 B at 1.2 kB/s)
[INFO] Uploading to ossrh: https://oss.sonatype.org:443/service/local/staging/deployByRepositoryId/camcgill-1029/ca/mcgill/sable/soot/3.3.0/soot-3.3.0-sources.jar
[INFO] Uploaded to ossrh: https://oss.sonatype.org:443/service/local/staging/deployByRepositoryId/camcgill-1029/ca/mcgill/sable/soot/3.3.0/soot-3.3.0-sources.jar (4.9 MB at 3.0 MB/s)
[INFO] Uploading to ossrh: https://oss.sonatype.org:443/service/local/staging/deployByRepositoryId/camcgill-1029/ca/mcgill/sable/soot/3.3.0/soot-3.3.0-jar-with-dependencies.jar
[INFO] Uploaded to ossrh: https://oss.sonatype.org:443/service/local/staging/deployByRepositoryId/camcgill-1029/ca/mcgill/sable/soot/3.3.0/soot-3.3.0-jar-with-dependencies.jar (14 MB at 3.0 MB/s)
[INFO]  * Upload of locally staged artifacts finished.
[INFO]  * Closing staging repository with ID "camcgill-1029".

Waiting for operation to complete...
.........

[INFO] Remote staged 1 repositories, finished with success.
[INFO] Remote staging repositories are being released...

Waiting for operation to complete...
...

[ERROR] 
[ERROR] Nexus Staging Rules Failure Report
[ERROR] ==================================
[ERROR] 
[ERROR] Repository "camcgill-1029" failures
[ERROR]   Rule "RepositoryWritePolicy" failures
[ERROR]     * Artifact updating: Repository ='releases:Releases' does not allow updating artifact='/ca/mcgill/sable/soot/3.3.0/soot-3.3.0.jar'
[ERROR]     * Artifact updating: Repository ='releases:Releases' does not allow updating artifact='/ca/mcgill/sable/soot/3.3.0/soot-3.3.0-javadoc.jar'
[ERROR]     * Artifact updating: Repository ='releases:Releases' does not allow updating artifact='/ca/mcgill/sable/soot/3.3.0/soot-3.3.0.pom'
[ERROR]     * Artifact updating: Repository ='releases:Releases' does not allow updating artifact='/ca/mcgill/sable/soot/3.3.0/soot-3.3.0-sources.jar'
[ERROR]     * Artifact updating: Repository ='releases:Releases' does not allow updating artifact='/ca/mcgill/sable/soot/3.3.0/soot-3.3.0-jar-with-dependencies.jar'
[ERROR] 
[ERROR] 
[WARNING] Attempt to (de-)serialize anonymous class org.jfrog.hudson.maven2.MavenDependenciesRecorder$1; see: https://jenkins.io/redirect/serialization-of-anonymous-classes/
[INFO] ------------------------------------------------------------------------
[INFO] BUILD FAILURE
[INFO] ------------------------------------------------------------------------
[INFO] Total time: 05:53 min
[INFO] Finished at: 2019-10-16T13:54:51+02:00
[INFO] Final Memory: 118M/1468M
[INFO] ------------------------------------------------------------------------
[ERROR] Failed to execute goal org.sonatype.plugins:nexus-staging-maven-plugin:1.6.8:deploy (injected-nexus-deploy) on project soot: Could not perform action: there are failing staging rules! Staging rules failure! -> [Help 1]
[ERROR] 
[ERROR] To see the full stack trace of the errors, re-run Maven with the -e switch.
[ERROR] Re-run Maven using the -X switch to enable full debug logging.
[ERROR] 
[ERROR] For more information about the errors and possible solutions, please read the following articles:
[ERROR] [Help 1] http://cwiki.apache.org/confluence/display/MAVEN/MojoExecutionException
[JENKINS] Archiving /data/jenkins/workspace/soot/soot-master/pom.xml to ca.mcgill.sable/soot/3.3.0/soot-3.3.0.pom
[JENKINS] Archiving /data/jenkins/workspace/soot/soot-master/target/sootclasses-trunk.jar to ca.mcgill.sable/soot/3.3.0/soot-3.3.0.jar
[JENKINS] Archiving /data/jenkins/workspace/soot/soot-master/target/sootclasses-trunk-jar-with-dependencies.jar to ca.mcgill.sable/soot/3.3.0/soot-3.3.0-jar-with-dependencies.jar
[JENKINS] Archiving /data/jenkins/workspace/soot/soot-master/target/sootclasses-trunk-sources.jar to ca.mcgill.sable/soot/3.3.0/soot-3.3.0-sources.jar
[JENKINS] Archiving /data/jenkins/workspace/soot/soot-master/target/sootclasses-trunk-javadoc.jar to ca.mcgill.sable/soot/3.3.0/soot-3.3.0-javadoc.jar
[JENKINS] Archiving /data/jenkins/workspace/soot/soot-master/target/sootclasses-trunk.jar.asc to ca.mcgill.sable/soot/3.3.0/soot-3.3.0.jar.asc
[JENKINS] Archiving /data/jenkins/workspace/soot/soot-master/target/sootclasses-trunk.pom.asc to ca.mcgill.sable/soot/3.3.0/soot-3.3.0.pom.asc
[JENKINS] Archiving /data/jenkins/workspace/soot/soot-master/target/sootclasses-trunk-jar-with-dependencies.jar.asc to ca.mcgill.sable/soot/3.3.0/soot-3.3.0-jar-with-dependencies.jar.asc
[JENKINS] Archiving /data/jenkins/workspace/soot/soot-master/target/sootclasses-trunk-sources.jar.asc to ca.mcgill.sable/soot/3.3.0/soot-3.3.0-sources.jar.asc
[JENKINS] Archiving /data/jenkins/workspace/soot/soot-master/target/sootclasses-trunk-javadoc.jar.asc to ca.mcgill.sable/soot/3.3.0/soot-3.3.0-javadoc.jar.asc
channel stopped
Finished: FAILURE